{"text_format":"1","workbook":"xlsx","n_sheets":17,"sheets":["MSL","Intro","Tool","Tool_BS","aj","Tree","Qc","Rep","BS","Feuil1","Histo","Cat","Path","structure","2018_SWA WES List","OLD_WES List","Feuil2"],"not_rendered":{"charts":0,"images":44,"macros":1,"external_links":0,"defined_names":39,"comments":4,"pivot_tables":0},"unopened":[],"bounds":{"document_bytes":16777216,"sheet_cells":100000,"rows_first":2000,"rows_last":500,"rows_between":2000,"halvings":0,"cell_chars":16384,"cell_head_chars":4096},"cells_cut":0,"cells_raw":0,"read":"whole","date_system":"1900"}

{"sheet":"MSL","index":0,"n_rows":17,"n_cols":14,"rows_kept":17,"cut":false,"hidden":false,"merged":[]}
[]
[]
[]
[]
[]
[]
[]
[]
[]
[]
[]
[]
[]
[]
[]
[]
[null,null,{"$f":"version","v":"Version 1,4 : July 2019"},null,null,null,null,null,null,null,null,null,null,{"$f":"authors","v":"This file has been created by Daniel Drolet and Ian Firth"}]

{"sheet":"Intro","index":1,"n_rows":19,"n_cols":14,"rows_kept":19,"cut":false,"hidden":false,"merged":[]}
[]
[]
[]
[]
[null,null,null,null,null,null,null,null,null,null,null,null,null," "]
[]
[]
[]
[]
[]
[]
[]
[]
[]
[]
[]
[]
[]
[null,null,{"$f":"version","v":"Version 1,4 : July 2019"},null,null,null,null,null,null,null,null,null,{"$f":"authors","v":"This file has been created by Daniel Drolet and Ian Firth"}]

{"sheet":"Tool","index":2,"n_rows":17,"n_cols":10,"rows_kept":17,"cut":false,"hidden":false,"merged":[[12,3,12,4],[13,3,13,4],[14,3,14,4],[11,3,11,4]]}
[]
[]
[]
[]
[]
[]
[]
[null,null,"Daily schedule",null,null,null,null,"Adjustment code",{"$f":"AdjCodexxx(choix1a,TableAjustement)","v":"1B"}]
[null,null,"Week schedule",null,null,null,null,"Adjustment factor",{"$f":"AdjFactor(AdjCodeQc,Daily_QC,Week_QC)","v":""}]
[]
[]
[null,null,null,"TWA",null,null,null,null,"Adj-TWA"]
[null,null,null,{"$f":"OEL_Value(choix1a,TableAjustement,5)","v":0.1},null,null,null,null,{"$f":"Adj_OEL($D13,Factor)","v":""}]
[null,null,null,{"$f":"OEL_Value(choix1a,TableAjustement,6)","v":0.66},null,null,null,null,{"$f":"Adj_OEL($D14,Factor)","v":""}]
[null,null,null,{"$f":"OEL_Value(choix1a,TableAjustement,7)","v":""},null,null,null,null,{"$f":"Adj_OEL($D15,Factor)","v":""}]
[]
[null,{"$f":"version","v":"Version 1,4 : July 2019"},null,null,null,null,null,null,null,{"$f":"authors","v":"This file has been created by Daniel Drolet and Ian Firth"}]

{"sheet":"Tool_BS","index":3,"n_rows":26,"n_cols":10,"rows_kept":26,"cut":false,"hidden":false,"merged":[[14,6,15,6],[14,7,15,7]]}
[]
[]
[]
[]
[]
[]
[]
[]
[]
[]
[]
[]
[]
[]
[null,null,"Daily schedule",null,null,null,"Adjustment\nfactor",{"$f":"AdjFactorBS(Schedule_BS,Daily_BS,Weekly_BS)","v":""}]
[null,null,"Week schedule"]
[]
[]
[]
[null,null,null,"TWA",null,null,null,"Adj-TWA"]
[null,null,null,{"$f":"OEL_Value(choix1aBS,TableAjustement,5)","v":10},null,null,null,{"$f":"Adj_OEL_BS(D21,Substance_BS,Factor_BS)","v":""}]
[null,null,null,{"$f":"OEL_Value(choix1aBS,TableAjustement,6)","v":25},null,null,null,{"$f":"Adj_OEL_BS(D22,Substance_BS,Factor_BS)","v":""}]
[null,null,null,{"$f":"OEL_Value(choix1aBS,TableAjustement,7)","v":""},null,null,null,{"$f":"Adj_OEL_BS(D23,Substance_BS,Factor_BS)","v":""}]
[]
[]
[null,{"$f":"version","v":"Version 1,4 : July 2019"},null,null,null,null,null,null,null,{"$f":"authors","v":"This file has been created by Daniel Drolet and Ian Firth"}]

{"sheet":"aj","index":4,"n_rows":660,"n_cols":16,"rows_kept":660,"cut":false,"hidden":false,"merged":[]}
[]
[null,"List of the substances from the SWA WES",null,null,null,"TWA",null,null,"STEL",null,null,"Peak"]
[]
[null,"#","SWA name","CAS","Adj","ppm","mg/m³","f/mL","ppm","mg/m³","f/mL","ppm","mg/m³","f/mL","WES ?","Num"]
[null,1,"Acetaldehyde ","75-07-0",4,20,36,null,50,91,null,null,null,null,"Y",{"$f":"B5","v":1}]
[null,2,"Acetic acid","64-19-7","1B",10,25,null,15,37,null,null,null,null,"Y",2]
[null,3,"Acetic anhydride","108-24-7","1A",null,null,null,null,null,null,5,21,null,"N",3]
[null,4,"Acetone","67-64-1",2,500,1185,null,1000,2375,null,null,null,null,"Y",4]
[null,5,"Acetonitrile","75-05-8",2,40,67,null,60,101,null,null,null,null,"Y",5]
[null,6,"Acetylsalicylic acid (Aspirin)","50-78-2",2,null,5,null,null,null,null,null,null,null,"Y",6]
[null,7,"Acrolein","107-02-8","1A",0.1,0.23,null,0.3,0.69,null,null,null,null,"Y",7]
[null,8,"Acrylamide (Acrylaldehyde)","79-06-1",3,null,0.03,null,null,null,null,null,null,null,"Y",8]
[null,9,"Acrylic acid","79-10-7",4,2,5.9,null,null,null,null,null,null,null,"Y",9]
[null,10,"Acrylonitrile (Vinyl cyanide)","107-13-1",4,2,4.3,null,null,null,null,null,null,null,"Y",10]
[null,11,"Aldrin","309-00-2",4,null,0.25,null,null,null,null,null,null,null,"Y",11]
[null,12,"Allyl alcohol","107-18-6",2,2,4.8,null,4,9.5,null,null,null,null,"Y",12]
[null,13,"Allyl chloride (3-Chloro-1-propene)","107-05-1",4,1,3,null,2,6,null,null,null,null,"Y",13]
[null,14,"Allyl glycidyl ether (AGE) (Allyl 2,3-epoxypropyl ether)","106-92-3",4,5,23,null,10,47,null,null,null,null,"Y",14]
[null,15,"Allyl propyl disulfide","2179-59-1","1B",2,12,null,3,18,null,null,null,null,"Y",15]
[null,16,"Aluminium (metal dust)","7429-90-5","1C",null,10,null,null,null,null,null,null,null,"Y",16]
[null,17,"Aluminium (welding fumes) (as Al)","7429-90-5","1C",null,5,null,null,null,null,null,null,null,"Y",17]
[null,18,"Aluminium oxide (alpha-Alumina (Al2O3))","1344-28-1","1C",null,10,null,null,null,null,null,null,null,"Y",18]
[null,19,"Aluminium, alkyls (NOC) (as Al)","7429-90-5","1B",null,2,null,null,null,null,null,null,null,"Y",19]
[null,20,"Aluminium, pyro powders (as Al)","7429-90-5","1C",null,5,null,null,null,null,null,null,null,"Y",20]
[null,21,"Aluminium, soluble salts (as Al)","7429-90-5","1B",null,2,null,null,null,null,null,null,null,"Y",21]
[null,22,"2-Aminopyridine (2-Pyridylamine)","504-29-0",2,0.5,2,null,null,null,null,null,null,null,"Y",22]
[null,23,"Amitrole (3-Amino-1,2,4-triazole)","61-82-5",3,null,0.2,null,null,null,null,null,null,null,"Y",23]
[null,24,"Ammonia","7664-41-7","1B",25,17,null,35,24,null,null,null,null,"Y",24]
[null,25,"Ammonium chloride (fume)","12125-02-9","1B",null,10,null,null,20,null,null,null,null,"Y",25]
[null,26,"Ammonium perfluorooctanoate ","3825-26-1",3,null,0.1,null,null,null,null,null,null,null,"Y",26]
[null,27,"Ammonium Persulfate","7727-54-0","1A",null,null,null,null,null,null,null,0.01,null,"N",27]
[null,28,"Ammonium sulphamate (Ammate)","7773-06-0","1B",null,10,null,null,null,null,null,null,null,"Y",28]
[null,29,"n-Amyl acetate (Pentyl acetate)","628-63-7","1B",50,270,null,100,541,null,null,null,null,"Y",29]
[null,30,"sec-Amyl acetate (1-Methylbutyl acetate)","626-38-0","1B",50,270,null,100,541,null,null,null,null,"Y",30]
[null,31,"Aniline & homologues","62-53-3",4,2,7.6,null,null,null,null,null,null,null,"Y",31]
[null,32,"Anisidine (o-, p- isomers) (Methoxyaniline)","29191-52-4",3,0.1,0.5,null,null,null,null,null,null,null,"Y",32]
[null,33,"Antimony & compounds (as Sb)","7440-36-0",3,null,0.5,null,null,null,null,null,null,null,"Y",33]
[null,34,"Antimony trioxide, handling and use (as Sb)","1309-64-4",3,null,0.5,null,null,null,null,null,null,null,"Y",34]
[null,35,"ANTU (1-Naphthylthiourea)","86-88-4",4,null,0.3,null,null,null,null,null,null,null,"Y",35]
[null,36,"Arsenic & soluble compounds (as As)","7440-38-2",4,null,0.05,null,null,null,null,null,null,null,"Y",36]
[null,37,"Arsine","7784-42-1",4,0.05,0.16,null,null,null,null,null,null,null,"Y",37]
[null,38,"Asbestos - Any mixture of commercial species, or where the composition is unknown","1332-21-4",3,null,null,0.1,null,null,null,null,null,null,"Y",38]
[null,39,"Asbestos - Amosite ","12172-73-5",3,null,null,0.1,null,null,null,null,null,null,"Y",39]
[null,40,"Asbestos - Chrysotile ","12001-29-5",3,null,null,0.1,null,null,null,null,null,null,"Y",40]
[null,41,"Asbestos - Crocidolite ","12001-28-4",3,null,null,0.1,null,null,null,null,null,null,"Y",41]
[null,42,"Asbestos - Other forms ",null,3,null,null,0.1,null,null,null,null,null,null,"Y",42]
[null,43,"Atrazine","1912-24-9",3,null,5,null,null,null,null,null,null,null,"Y",43]
[null,44,"Azinphos-methyl (Guthion)","86-50-0",4,null,0.2,null,null,null,null,null,null,null,"Y",44]
[null,45,"Barium sulphate ","7727-43-7",3,null,10,null,null,null,null,null,null,null,"Y",45]
[null,46,"Barium, soluble compounds (as Ba)","7440-39-3",2,null,0.5,null,null,null,null,null,null,null,"Y",46]
[null,47,"Benomyl (Benlate)","17804-35-2",4,0.84,10,null,null,null,null,null,null,null,"Y",47]
[null,48,"Benzene","71-43-2",3,1,3.2,null,null,null,null,null,null,null,"Y",48]
[null,49,"Benzoyl peroxide (Dibenzoyl peroxide)","94-36-0","1B",null,5,null,null,null,null,null,null,null,"Y",49]
[null,50,"Benzyl chloride (alpha-Chlorotoluene)","100-44-7",4,1,5.2,null,null,null,null,null,null,null,"Y",50]
[null,51,"Beryllium & compounds","7440-41-7",3,null,2E-3,null,null,null,null,null,null,null,"Y",51]
[null,52,"Biphenyl (Diphenyl, Phenylbenzene)","92-52-4",4,0.2,1.3,null,null,null,null,null,null,null,"Y",52]
[null,53,"Bismuth telluride (Dibismuth tritelluride)","1304-82-1","1C",null,10,null,null,null,null,null,null,null,"Y",53]
[null,54,"Bismuth telluride, Se-doped","1304-82-1",3,null,5,null,null,null,null,null,null,null,"Y",54]
[null,55,"Bitumen fumes (Asphalt (petroleum))","8052-42-4",4,null,5,null,null,null,null,null,null,null,"Y",55]
[null,56,"Borates, tetra, sodium salts (anhydrous) (Disodium tetraborate anhydrous)","1330-43-4","1B",null,1,null,null,null,null,null,null,null,"Y",56]
[null,57,"Borates, tetra, sodium salts (decahydrate) (Disodium tetraborate decahydrate, Borax)","1303-96-4","1B",null,5,null,null,null,null,null,null,null,"Y",57]
[null,58,"Borates, tetra, sodium salts (pentahydrate) (Disodium tetraborate pentahydrate)","12179-04-3","1B",null,1,null,null,null,null,null,null,null,"Y",58]
[null,59,"Boron oxide (Diboron trioxide)","1303-86-2","1B",null,10,null,null,null,null,null,null,null,"Y",59]
[null,60,"Boron tribromide","10294-33-4","1A",null,null,null,null,null,null,1,10,null,"N",60]
[null,61,"Boron trifluoride","7637-07-2","1A",null,null,null,null,null,null,1,2.8,null,"N",61]
[null,62,"Bromacil","314-40-9",3,1,11,null,null,null,null,null,null,null,"Y",62]
[null,63,"Bromine","7726-95-6","1B",0.1,0.66,null,0.3,2,null,null,null,null,"Y",63]
[null,64,"Bromine pentafluoride","7789-30-2","1B",0.1,0.72,null,null,null,null,null,null,null,"Y",64]
[null,65,"Bromoform (Tribromomethane)","75-25-2",4,0.5,5.2,null,null,null,null,null,null,null,"Y",{"$f":"B69","v":65}]
[null,66,"1,3-Butadiene ","106-99-0",3,10,22,null,null,null,null,null,null,null,"Y",66]
[null,67,"Butane","106-97-8","1C",800,1900,null,null,null,null,null,null,null,"Y",67]
[null,68,"2-Butoxyethanol (Butyl cellosolve, Butyl glycol, Ethylene glycol)","111-76-2","1B",20,96.9,null,50,242,null,null,null,null,"Y",68]
[null,69,"2-Butoxyethyl acetate","112-07-2","1B",20,133,null,50,333,null,null,null,null,"Y",69]
[null,70,"n-Butyl acetate","123-86-4",2,150,713,null,200,950,null,null,null,null,"Y",70]
[null,71,"sec-Butyl acetate","105-46-4",2,200,950,null,null,null,null,null,null,null,"Y",71]
[null,72,"tert-Butyl acetate","540-88-5",2,200,950,null,null,null,null,null,null,null,"Y",72]
[null,73,"n-Butyl acrylate (Acrylic acid, n-butyl ester)","141-32-2",4,1,5,null,5,26,null,null,null,null,"Y",73]
[null,74,"n-Butyl alcohol (n-Butanol)","71-36-3","1A",null,null,null,null,null,null,50,152,null,"N",74]
[null,75,"sec-Butyl alcohol (sec-Butanol, Butan-2-ol)","78-92-2",2,100,303,null,null,null,null,null,null,null,"Y",75]
[null,76,"tert-Butyl alcohol (tert-Butanol, 2-Methylpropan-2-ol)","75-65-0",2,100,303,null,150,455,null,null,null,null,"Y",76]
[null,77,"tert-Butyl chromate (as CrO3)","1189-85-1","1A",null,null,null,null,null,null,null,0.1,null,"N",77]
[null,78,"n-Butyl glycidyl ether (BGE) (1-Butoxy-2,3-epoxypropane, Butyl-2,3-epoxypropyl ether)","2426-08-6",3,25,133,null,null,null,null,null,null,null,"Y",78]
[null,79,"n-Butyl lactate","138-22-7","1B",5,30,null,null,null,null,null,null,null,"Y",79]
[null,80,"Butyl mercaptan (Butanethiol)","109-79-5","1B",0.5,1.8,null,null,null,null,null,null,null,"Y",80]
[null,81,"Butylamine","109-73-9","1A",null,null,null,null,null,null,5,15,null,"N",81]
[null,82,"o-sec-Butylphenol","89-72-5","1B",5,31,null,null,null,null,null,null,null,"Y",82]
[null,83,"p-tert-Butyltoluene ","98-51-1",3,10,61,null,20,121,null,null,null,null,"Y",83]
[null,84,"Cadmium and compounds (as Cd)","7440-43-9",3,null,0.01,null,null,null,null,null,null,null,"Y",84]
[null,85,"Caesium hydroxide","21351-79-1","1B",null,2,null,null,null,null,null,null,null,"Y",85]
[null,86,"Calcium carbonate (Limestone, Marble)","471-34-1","1C",null,10,null,null,null,null,null,null,null,"Y",86]
[null,87,"Calcium cyanamide (Calcium carbimide)","156-62-7",2,null,0.5,null,null,null,null,null,null,null,"Y",87]
[null,88,"Calcium hydroxide (slaked lime)","1305-62-0","1B",null,5,null,null,null,null,null,null,null,"Y",88]
[null,89,"Calcium oxide (lime)","1305-78-8",2,null,2,null,null,null,null,null,null,null,"Y",89]
[null,90,"Calcium silicate ","1344-95-2","1C",null,10,null,null,null,null,null,null,null,"Y",90]
[null,91,"Calcium sulphate (Gypsum, Plaster of Paris)","7778-18-9","1C",null,10,null,null,null,null,null,null,null,"Y",91]
[null,92,"Camphor, synthetic (Bornan-2-one)","76-22-2","1B",2,12,null,3,19,null,null,null,null,"Y",92]
[null,93,"e-Caprolactam (dust and vapour) (1,6-Hexanelactam, Hexahydro-2H-azepin-2-one)","105-60-2","1B",null,10,null,null,20,null,null,null,null,"Y",93]
[null,94,"Caprolactam (dust)","105-60-2","1B",null,1,null,null,3,null,null,null,null,"Y",94]
[null,95,"Captafol (Difolatan)","2425-06-1",4,null,0.1,null,null,null,null,null,null,null,"Y",95]
[null,96,"Captan","133-06-2",4,null,0.5,null,null,null,null,null,null,null,"Y",96]
[null,97,"Carbaryl (Sevin)","63-25-2",4,null,5,null,null,null,null,null,null,null,"Y",97]
[null,98,"Carbofuran (Furadan)","1563-66-2",4,null,0.1,null,null,null,null,null,null,null,"Y",98]
[null,99,"Carbon black","1333-86-4",3,null,3,null,null,null,null,null,null,null,"Y",99]
[null,100,"Carbon dioxide","124-38-9","1C",5000,9000,null,30000,54000,null,null,null,null,"Y",100]
[null,101,"Carbon dioxide in coal mines","124-38-9","1C",12500,22500,null,30000,54000,null,null,null,null,"Y",101]
[null,102,"Carbon disulphide","75-15-0",4,10,31,null,null,null,null,null,null,null,"Y",102]
[null,103,"Carbon monoxide ","630-08-0",4,30,34,null,null,null,null,null,null,null,"Y",103]
[null,104,"Carbon tetrabromide (Tetrabromomethane)","558-13-4",4,0.1,1.4,null,0.3,4.0999999999999996,null,null,null,null,"Y",104]
[null,105,"Carbon tetrachloride (Tetrachloromethane)","56-23-5",4,0.1,0.63,null,null,null,null,null,null,null,"Y",105]
[null,106,"Carbonyl fluoride","353-50-4",4,2,5.4,null,5,13,null,null,null,null,"Y",106]
[null,107,"Catechol (Pyrocatechol, o-Dihydroxybenzene, 1,2-Benzenediol)","120-80-9",4,5,23,null,null,null,null,null,null,null,"Y",107]
[null,108,"Cellulose (paper fibre) ","9004-34-6","1C",null,10,null,null,null,null,null,null,null,"Y",108]
[null,109,"Chlordane","57-74-9",4,null,0.5,null,null,null,null,null,null,null,"Y",109]
[null,110,"Chlorinated camphene (Camphechlor)","8001-35-2",4,null,0.5,null,null,1,null,null,null,null,"Y",110]
[null,111,"Chlorinated diphenyl oxide","31242-93-0",3,null,0.5,null,null,null,null,null,null,null,"Y",111]
[null,112,"Chlorine","7782-50-5","1A",null,null,null,null,null,null,1,3,null,"N",112]
[null,113,"Chlorine dioxide","10049-04-4",2,0.1,0.28000000000000003,null,0.3,0.83,null,null,null,null,"Y",113]
[null,114,"Chlorine trifluoride","7790-91-2","1A",null,null,null,null,null,null,0.1,0.38,null,"N",114]
[null,115,"1-Chloro-1-nitropropane","600-25-9",2,2,10,null,null,null,null,null,null,null,"Y",115]
[null,116,"Chloroacetaldehyde","107-20-0","1A",null,null,null,null,null,null,1,3.2,null,"N",116]
[null,117,"Chloroacetone","78-95-5","1A",null,null,null,null,null,null,1,3.8,null,"N",117]
[null,118,"alpha-Chloroacetophenone (Phenacyl chloride)","532-27-4","1B",0.05,0.32,null,null,null,null,null,null,null,"Y",118]
[null,119,"Chloroacetyl chloride (Chloroacetic acid chloride)","79-04-9",4,0.05,0.23,null,0.15,0.69,null,null,null,null,"Y",119]
[null,120,"Chlorobenzene","108-90-7",4,10,46,null,null,null,null,null,null,null,"Y",120]
[null,121,"o-Chlorobenzylidene malononitrile","2698-41-1","1A",null,null,null,null,null,null,0.05,0.39,null,"N",121]
[null,122,"Chlorobromomethane (Bromochloromethane)","74-97-5",3,200,1060,null,null,null,null,null,null,null,"Y",122]
[null,123,"Chlorodifluoromethane (Difluorochloromethane, Fluorocarbon 22, Freon 22)","75-45-6","1C",1000,3540,null,null,null,null,null,null,null,"Y",123]
[null,124,"Chloroform (Trichloromethane)","67-66-3",4,2,10,null,null,null,null,null,null,null,"Y",124]
[null,125,"bis(Chloromethyl) ether","542-88-1",3,1E-3,5.0000000000000001E-3,null,null,null,null,null,null,null,"Y",125]
[null,126,"Chloropentafluoroethane (Fluorocarbon 115, Freon 115)","76-15-3","1C",1000,6320,null,null,null,null,null,null,null,"Y",126]
[null,127,"Chloropicrin (Trichloronitromethane)","76-06-2",2,0.1,0.67,null,null,null,null,null,null,null,"Y",127]
[null,128,"beta-Chloroprene (2-Chloro-1,3-butadiene)","126-99-8",4,10,36,null,null,null,null,null,null,null,"Y",128]
[null,129,"2-Chloropropionic acid","598-78-7",3,0.1,0.44,null,null,null,null,null,null,null,"Y",{"$f":"B133","v":129}]
[null,130,"o-Chlorostyrene","2039-87-4",4,50,283,null,75,425,null,null,null,null,"Y",130]
[null,131,"Chlorosulphonic acid","7790-94-5",2,0.20899999999999999,1,null,null,null,null,null,null,null,"Y",131]
[null,132,"o-Chlorotoluene","95-49-8","1B",50,259,null,null,null,null,null,null,null,"Y",132]
[null,133,"Chlorpyrifos (Dursban)","2921-88-2",4,null,0.2,null,null,null,null,null,null,null,"Y",133]
[null,134,"Chromium (II) compounds (as Cr)",null,3,null,0.5,null,null,null,null,null,null,null,"Y",134]
[null,135,"Chromium (III) compounds (as Cr)",null,3,null,0.5,null,null,null,null,null,null,null,"Y",135]
[null,136,"Chromium (metal)","7440-47-3",3,null,0.5,null,null,null,null,null,null,null,"Y",136]
[null,137,"Chromium (VI) compounds (as Cr), certain water insoluble ",null,4,null,0.05,null,null,null,null,null,null,null,"Y",137]
[null,138,"Chromium (VI) compounds (as Cr), water soluble",null,3,null,0.05,null,null,null,null,null,null,null,"Y",138]
[null,139,"Clopidol (Coyden)","2971-90-6","1C",null,10,null,null,null,null,null,null,null,"Y",139]
[null,140,"Coal dust (containing < 5% quartz) (respirable dust)",null,3,null,3,null,null,null,null,null,null,null,"Y",140]
[null,141,"Coal tar pitch volatiles (as benzene solubles)","65996-93-2",3,null,0.2,null,null,null,null,null,null,null,"Y",141]
[null,142,"Cobalt carbonyl (as Co)","10210-68-1",2,null,0.1,null,null,null,null,null,null,null,"Y",142]
[null,143,"Cobalt hydrocarbonyl (as Co)","16842-03-8",2,null,0.1,null,null,null,null,null,null,null,"Y",143]
[null,144,"Cobalt, metal dust & fume (as Co) ","7440-48-4",4,null,0.05,null,null,null,null,null,null,null,"Y",144]
[null,145,"Copper (fume)","7440-50-8",2,null,0.2,null,null,null,null,null,null,null,"Y",145]
[null,146,"Copper, dusts & mists (as Cu)","7440-50-8",2,null,1,null,null,null,null,null,null,null,"Y",146]
[null,147,"Cotton dust, raw ",null,3,null,0.2,null,null,null,null,null,null,null,"Y",147]
[null,148,"Cresol, all isomers","1319-77-3",2,5,22,null,null,null,null,null,null,null,"Y",148]
[null,149,"Cristobalite (respirable dust)","14464-46-1",3,null,0.05,null,null,null,null,null,null,null,"Y",149]
[null,150,"Crotonaldehyde (trans-But-2-enal)","4170-30-3",4,2,5.7,null,null,null,null,null,null,null,"Y",150]
[null,151,"Crufomate","299-86-5",4,null,5,null,null,null,null,null,null,null,"Y",151]
[null,152,"Cumene (Isopropyl benzene)","98-82-8",4,25,125,null,75,375,null,null,null,null,"Y",152]
[null,153,"Cyanamide","420-04-2",4,null,2,null,null,null,null,null,null,null,"Y",153]
[null,154,"Cyanides (as CN)","151-50-8",2,null,5,null,null,null,null,null,null,null,"Y",154]
[null,155,"Cyanogen (Oxalonitrile)","460-19-5","1B",10,21,null,null,null,null,null,null,null,"Y",155]
[null,156,"Cyanogen chloride","506-77-4","1A",null,null,null,null,null,null,0.3,0.75,null,"N",156]
[null,157,"Cyclohexane","110-82-7",2,100,350,null,300,1050,null,null,null,null,"Y",157]
[null,158,"Cyclohexanol","108-93-0",4,50,206,null,null,null,null,null,null,null,"Y",158]
[null,159,"Cyclohexanone (Anone)","108-94-1",3,25,100,null,null,null,null,null,null,null,"Y",159]
[null,160,"Cyclohexene","110-83-8","1B",300,1010,null,null,null,null,null,null,null,"Y",160]
[null,161,"Cyclohexylamine (Aminocyclohexane)","108-91-8",2,10,41,null,null,null,null,null,null,null,"Y",161]
[null,162,"Cyclonite (Hexahydro-1,3,5-trinitro-1,3,5-triazine, RDX)","121-82-4",3,null,1.5,null,null,null,null,null,null,null,"Y",162]
[null,163,"Cyclopentadiene","542-92-7","1B",75,203,null,null,null,null,null,null,null,"Y",163]
[null,164,"Cyclopentane","287-92-3",4,600,1720,null,null,null,null,null,null,null,"Y",164]
[null,165,"Cyhexatin (Tricyclohexyltin hydroxide, Plictran)","13121-70-5","1C",null,5,null,null,null,null,null,null,null,"Y",165]
[null,166,"2,4-D (2,4-Dichlorophenoxyacetic acid)","94-75-7",3,null,10,null,null,null,null,null,null,null,"Y",166]
[null,167,"DDT (Dichlorodiphenyl-trichloroethane)","50-29-3",4,null,1,null,null,null,null,null,null,null,"Y",167]
[null,168,"Decaborane","17702-41-9",4,0.05,0.25,null,0.15,0.75,null,null,null,null,"Y",168]
[null,169,"Demeton (Systox)","8065-48-3",4,0.01,0.11,null,null,null,null,null,null,null,"Y",169]
[null,170,"Diacetone alcohol (4-Hydroxy-4-methyl-2-pentanone)","123-42-2","1B",50,238,null,null,null,null,null,null,null,"Y",170]
[null,171,"Diatomaceous earth (uncalcined) ","61790-53-2","1C",null,10,null,null,null,null,null,null,null,"Y",171]
[null,172,"Diazinon","333-41-5",4,null,0.1,null,null,null,null,null,null,null,"Y",172]
[null,173,"Diazomethane","334-88-3",4,0.2,0.34,null,null,null,null,null,null,null,"Y",173]
[null,174,"Diborane","19287-45-7",4,0.1,0.11,null,null,null,null,null,null,null,"Y",174]
[null,175,"Dibutyl phenyl phosphate","2528-36-1",4,0.3,3.5,null,null,null,null,null,null,null,"Y",175]
[null,176,"Dibutyl phosphate (Dibutyl hydrogen phosphate)","107-66-4","1B",1,8.6,null,2,17,null,null,null,null,"Y",176]
[null,177,"Dibutyl phthalate","84-74-2",4,null,5,null,null,null,null,null,null,null,"Y",177]
[null,178,"2-N-Dibutylaminoethanol (N,N-Di-n-butylaminoethanol)","102-81-8",3,2,14,null,null,null,null,null,null,null,"Y",178]
[null,179,"1,1-Dichloro-1-nitroethane","594-72-9",2,2,12,null,null,null,null,null,null,null,"Y",179]
[null,180,"1,3-Dichloro-5,5-dimethyl hydantoin","118-52-5","1B",null,0.2,null,null,0.4,null,null,null,null,"Y",180]
[null,181,"Dichloroacetylene","7572-29-4","1A",null,null,null,null,null,null,0.1,0.39,null,"N",181]
[null,182,"o-Dichlorobenzene (1,2-dichlorobenzene)","95-50-1","1B",25,150,null,50,301,null,null,null,null,"Y",182]
[null,183,"p-Dichlorobenzene (1,4-dichlorobenzene)","106-46-7",3,25,150,null,50,300,null,null,null,null,"Y",183]
[null,184,"Dichlorodifluoromethane (Fluorocarbon 12, Freon 12)","75-71-8","1C",1000,4950,null,null,null,null,null,null,null,"Y",184]
[null,185,"1,1-Dichloroethane (Ethylidene chloride)","75-34-3",4,100,412,null,null,null,null,null,null,null,"Y",185]
[null,186,"Dichloroethyl ether (bis-(2-Chloroethyl)-ether)","111-44-4",4,5,29,null,10,58,null,null,null,null,"Y",186]
[null,187,"1,2-Dichloroethylene (Acetylene dichloride)","540-59-0",4,200,793,null,null,null,null,null,null,null,"Y",187]
[null,188,"Dichlorofluoromethane (Fluorocarbon 21, Freon 21)","75-43-4",3,10,42,null,null,null,null,null,null,null,"Y",188]
[null,189,"Dichloropropene (gamma-Chloroallyl chloride, 1,3-dichloropropene)","542-75-6",4,1,4.5,null,null,null,null,null,null,null,"Y",189]
[null,190,"2,2-Dichloropropionic acid (Dalapon)","75-99-0","1B",1,5.8,null,null,null,null,null,null,null,"Y",190]
[null,191,"Dichlorotetrafluoroethane (Fluorocarbon 114, Freon 114, R-114, Tetrafluoro dichloroethane)","76-14-2","1C",1000,6990,null,null,null,null,null,null,null,"Y",191]
[null,192,"Dichlorvos (DDVP)","62-73-7",4,0.1,0.9,null,null,null,null,null,null,null,"Y",192]
[null,193,"Dicrotophos (Bidrin)","141-66-2",4,null,0.25,null,null,null,null,null,null,null,"Y",{"$f":"B197","v":193}]
[null,194,"Dicyclopentadiene (3a,4,7,7a-tetrahydro-4,7-methanoindene)","77-73-6",3,5,27,null,null,null,null,null,null,null,"Y",194]
[null,195,"Dicyclopentadienyl iron (Ferrocene)","102-54-5","1C",null,10,null,null,null,null,null,null,null,"Y",195]
[null,196,"Dieldrin","60-57-1",4,null,0.25,null,null,null,null,null,null,null,"Y",196]
[null,197,"Diethanolamine (2,2'-Iminodiethanol)","111-42-2",4,3,13,null,null,null,null,null,null,null,"Y",197]
[null,198,"Diethyl ketone (3-Pentanone)","96-22-0",2,200,705,null,null,null,null,null,null,null,"Y",198]
[null,199,"Diethyl phthalate","84-66-2","1B",null,5,null,null,null,null,null,null,null,"Y",199]
[null,200,"Diethylamine ","109-89-7","1B",10,30,null,25,75,null,null,null,null,"Y",200]
[null,201,"2-Diethylaminoethanol ","100-37-8",2,10,48,null,null,null,null,null,null,null,"Y",201]
[null,202,"Diethylene triamine (2,2'-Diaminodiethylamine, 1,4,7-Tri-(aza)-heptane)","111-40-0",4,1,4.2,null,null,null,null,null,null,null,"Y",202]
[null,203,"Difluorodibromomethane (Dibromodifluoromethane)","75-61-6",4,100,858,null,null,null,null,null,null,null,"Y",203]
[null,204,"Diglycidyl ether (DGE, bis(2,3-Epoxy propyl) ether)","2238-07-5",3,0.1,0.53,null,null,null,null,null,null,null,"Y",204]
[null,205,"Diisobutyl ketone (2,6-Dimethyl-4-heptanone)","108-83-8","1B",25,145,null,null,null,null,null,null,null,"Y",205]
[null,206,"Diisopropylamine","108-18-9",2,5,21,null,null,null,null,null,null,null,"Y",206]
[null,207,"Dimethyl acetamide","127-19-5",4,10,36,null,null,null,null,null,null,null,"Y",207]
[null,208,"Dimethyl ether","115-10-6","1B",400,760,null,500,950,null,null,null,null,"Y",208]
[null,209,"Dimethyl sulphate","77-78-1",4,0.1,0.52,null,null,null,null,null,null,null,"Y",209]
[null,210,"Dimethylamine","124-40-3",2,2,3.8,null,6,11,null,null,null,null,"Y",210]
[null,211,"Dimethylaminoethanol","108-01-0",2,2,7.4,null,6,22,null,null,null,null,"Y",211]
[null,212,"N,N-Dimethylaniline","121-69-7",4,5,25,null,10,50,null,null,null,null,"Y",212]
[null,213,"N,N-Dimethylethylamine (ethyldimethylamine)","598-56-1",4,10,30,null,15,45,null,null,null,null,"Y",213]
[null,214,"Dimethylformamide","68-12-2",3,10,30,null,null,null,null,null,null,null,"Y",214]
[null,215,"1,1-Dimethylhydrazine","57-14-7",3,0.01,2.5000000000000001E-2,null,null,null,null,null,null,null,"Y",215]
[null,216,"Dimethylphthalate","131-11-3","1B",null,5,null,null,null,null,null,null,null,"Y",216]
[null,217,"Dinitolmide (3,5-Dinitro-o-toluamide, Zoalene)","148-01-6",3,null,5,null,null,null,null,null,null,null,"Y",217]
[null,218,"m-Dinitrobenzene (1,3-dinitrobenzene)","99-65-0",4,0.15,1,null,null,null,null,null,null,null,"Y",218]
[null,219,"o-Dinitrobenzene (1,2-dinitrobenzene)","528-29-0",4,0.15,1,null,null,null,null,null,null,null,"Y",219]
[null,220,"p-Dinitrobenzene (1,4-dinitrobenzene)","100-25-4",4,0.15,1,null,null,null,null,null,null,null,"Y",220]
[null,221,"Dinitro-o-cresol (DNOC, 2-Methyl-4,6-dinitrophenol)","534-52-1",3,null,0.2,null,null,null,null,null,null,null,"Y",221]
[null,222,"Dinitrotoluene ","25321-14-6",4,null,1.5,null,null,null,null,null,null,null,"Y",222]
[null,223,"1,4-Dioxane (Diethylene dioxide)","123-91-1",3,10,36,null,null,null,null,null,null,null,"Y",223]
[null,224,"Dioxathion (Delnav)","78-34-2",4,null,0.2,null,null,null,null,null,null,null,"Y",224]
[null,225,"Diphenylamine","122-39-4",4,null,10,null,null,null,null,null,null,null,"Y",225]
[null,226,"Dipropyl ketone (4-Heptanone)","123-19-3","1B",50,233,null,null,null,null,null,null,null,"Y",226]
[null,227,"Diquat (Diquat dibromide (ISO))","85-00-7",3,null,0.5,null,null,null,null,null,null,null,"Y",227]
[null,228,"Di-sec-octyl phthalate (DOP, Di (2-ethylhexyl) phthalate, bis(2-Ethylhexyl) phthalate)","117-81-7",3,null,5,null,null,10,null,null,null,null,"Y",228]
[null,229,"Disulfiram (Tetraethyl thiuram disulphide)","97-77-8",4,null,2,null,null,null,null,null,null,null,"Y",229]
[null,230,"Disulfoton (Disyston)","298-04-4",4,null,0.1,null,null,null,null,null,null,null,"Y",230]
[null,231,"2,6-Di-tert-butyl-p-cresol","128-37-0","1C",null,10,null,null,null,null,null,null,null,"Y",231]
[null,232,"Diuron","330-54-1",4,null,10,null,null,null,null,null,null,null,"Y",232]
[null,233,"Divinyl benzene","1321-74-0","1B",10,53,null,null,null,null,null,null,null,"Y",233]
[null,234,"Emery (dust) ","1302-74-5","1C",null,10,null,null,null,null,null,null,null,"Y",234]
[null,235,"Endosulfan (Thiodan)","115-29-7",2,null,0.1,null,null,null,null,null,null,null,"Y",235]
[null,236,"Endrin","72-20-8",2,null,0.1,null,null,null,null,null,null,null,"Y",236]
[null,237,"Enflurane (2-Chloro-1,1,2-trifluoroethyl difluoromethyl ether)","13838-16-9",2,0.5,3.8,null,null,null,null,null,null,null,"Y",237]
[null,238,"Epichlorohydrin (1-Chloro-2,3-epoxy-propane; Oxirane, (chloromethyl)-)","106-89-8",4,2,7.6,null,null,null,null,null,null,null,"Y",238]
[null,239,"EPN (O-Ethyl-O-(4-nitrophenyl) phenylthiophosphonate)","2104-64-5",4,null,0.5,null,null,null,null,null,null,null,"Y",239]
[null,240,"Ethanolamine (2-Aminoethanol)","141-43-5",3,3,7.5,null,6,15,null,null,null,null,"Y",240]
[null,241,"Ethion (Nialate)","563-12-2",4,null,0.4,null,null,null,null,null,null,null,"Y",241]
[null,242,"2-Ethoxyethanol (Cellosolve; Ethyl glycol; Ethylene glycol, monoethyl ether; Glycol, monoethyl ether)","110-80-5",4,5,18,null,null,null,null,null,null,null,"Y",242]
[null,243,"2-Ethoxyethyl acetate (Cellosolve acetate; Glycol, monoethyl ether acetate; Ethylene glycol, monoethyl ether acetate; Ethyl glycol acetate)","111-15-9",4,5,27,null,null,null,null,null,null,null,"Y",243]
[null,244,"Ethyl acetate (Acetic acid ethyl ester, Acetic ester)","141-78-6","1B",200,720,null,400,1440,null,null,null,null,"Y",244]
[null,245,"Ethyl acrylate (Acrylic acid,ethyl ester)","140-88-5",4,null,null,null,null,null,null,5,20,null,"N",245]
[null,246,"Ethyl alcohol (Ethanol)","64-17-5","1B",1000,1880,null,null,null,null,null,null,null,"Y",246]
[null,247,"Ethyl benzene","100-41-4",4,100,434,null,125,543,null,null,null,null,"Y",247]
[null,248,"Ethyl bromide (Bromoethane)","74-96-4",4,5,22,null,null,null,null,null,null,null,"Y",248]
[null,249,"Ethyl butyl ketone (3-Heptanone)","106-35-4",2,50,234,null,null,null,null,null,null,null,"Y",249]
[null,250,"Ethyl chloride (Chloroethane)","75-00-3",4,1000,2640,null,null,null,null,null,null,null,"Y",250]
[null,251,"Ethyl ether (Diethyl ether)","60-29-7","1B",400,1210,null,500,1520,null,null,null,null,"Y",251]
[null,252,"Ethyl formate (Formic acid, ethyl ester)","109-94-4","1B",100,303,null,null,null,null,null,null,null,"Y",252]
[null,253,"Ethyl mercaptan (Ethanethiol)","75-08-1","1B",0.5,1.3,null,null,null,null,null,null,null,"Y",253]
[null,254,"Ethyl silicate (Tetraethyl orthosilicate)","78-10-4",3,10,85,null,null,null,null,null,null,null,"Y",254]
[null,255,"Ethylamine","75-04-7","1B",2,3.8,null,6,11,null,null,null,null,"Y",255]
[null,256,"Ethylene chlorohydrin (2-Chloroethanol)","107-07-3","1A",null,null,null,null,null,null,1,3.3,null,"N",256]
[null,257,"Ethylene dichloride (1,2-Dichloroethane)","107-06-2",4,10,40,null,null,null,null,null,null,null,"Y",{"$f":"B261","v":257}]
[null,258,"Ethylene glycol (particulate) (Ethane-1,2-diol)","107-21-1",2,null,10,null,null,null,null,null,null,null,"Y",258]
[null,259,"Ethylene glycol (vapour) (Ethane-1,2-diol)","107-21-1",2,20,52,null,40,104,null,null,null,null,"Y",259]
[null,260,"Ethylene glycol dinitrate (EGDN, Ethylene dinitrate, Glycol dinitrate, Nitroglycol)","628-96-6",4,0.05,0.31,null,null,null,null,null,null,null,"Y",260]
[null,261,"Ethylene oxide (Oxirane)","75-21-8",3,1,1.8,null,null,null,null,null,null,null,"Y",261]
[null,262,"Ethylenediamine (1,2-Diaminoethane)","107-15-3",3,10,25,null,null,null,null,null,null,null,"Y",262]
[null,263,"Ethylenimine (Aziridine)","151-56-4",4,0.5,0.88,null,null,null,null,null,null,null,"Y",263]
[null,264,"Ethylidene norbornene","16219-75-3","1A",null,null,null,null,null,null,5,25,null,"N",264]
[null,265,"N-Ethylmorpholine","100-74-3",2,5,24,null,null,null,null,null,null,null,"Y",265]
[null,266,"Fenamiphos (Nemacur)","22224-92-6",4,null,0.1,null,null,null,null,null,null,null,"Y",266]
[null,267,"Fensulfothion (Dasanit)","115-90-2",4,null,0.1,null,null,null,null,null,null,null,"Y",267]
[null,268,"Fenthion (Baytex, Lebaycid)","55-38-9",4,null,0.2,null,null,null,null,null,null,null,"Y",268]
[null,269,"Ferbam","14484-64-1",3,null,10,null,null,null,null,null,null,null,"Y",269]
[null,270,"Ferrovanadium dust","12604-58-9","1B",null,1,null,null,3,null,null,null,null,"Y",270]
[null,271,"Fluorides (as F)",null,3,null,2.5,null,null,null,null,null,null,null,"Y",271]
[null,272,"Fluorine","7782-41-4","1B",1,1.6,null,2,3.1,null,null,null,null,"Y",272]
[null,273,"Fonofos (Dyfonate)","944-22-9",4,null,0.1,null,null,null,null,null,null,null,"Y",273]
[null,274,"Formaldehyde ","50-00-0",4,1,1.2,null,2,2.5,null,null,null,null,"Y",274]
[null,275,"Formamide","75-12-7",3,10,18,null,null,null,null,null,null,null,"Y",275]
[null,276,"Formic acid","64-18-6",2,5,9.4,null,10,19,null,null,null,null,"Y",276]
[null,277,"Fumed silica (respirable dust)","69012-64-2",3,null,2,null,null,null,null,null,null,null,"Y",277]
[null,278,"Furfural (2-Furaldehyde; 2-Furancarboxaldehyde)","98-01-1",4,2,7.9,null,null,null,null,null,null,null,"Y",278]
[null,279,"Furfuryl alcohol","98-00-0",4,10,40,null,15,60,null,null,null,null,"Y",279]
[null,280,"Germanium tetrahydride (Germane)","7782-65-2",2,0.2,0.63,null,null,null,null,null,null,null,"Y",280]
[null,281,"Glutaraldehyde (1,5-Pentanedial)","111-30-8","1A",null,null,null,null,null,null,0.1,0.41,null,"N",281]
[null,282,"Glycerin mist ","56-81-5","1C",null,10,null,null,null,null,null,null,null,"Y",282]
[null,283,"Glycidol (2,3-Epoxy-1-propanol)","556-52-5",4,25,76,null,null,null,null,null,null,null,"Y",283]
[null,284,"Grain dust (oats,wheat, barley)",null,4,null,4,null,null,null,null,null,null,null,"Y",284]
[null,285,"Graphite (all forms except fibres) (respirable dust) (natural & synthetic)","7782-42-5",3,null,3,null,null,null,null,null,null,null,"Y",285]
[null,286,"Hafnium","7440-58-6",3,null,0.5,null,null,null,null,null,null,null,"Y",286]
[null,287,"Halothane (1,1,1-Trifluoro-2-chloro-2-bromoethane)","151-67-7",4,0.5,4.0999999999999996,null,null,null,null,null,null,null,"Y",287]
[null,288,"Heptachlor ","76-44-8",4,null,0.5,null,null,null,null,null,null,null,"Y",288]
[null,289,"Heptane (n-Heptane)","142-82-5",2,400,1640,null,500,2050,null,null,null,null,"Y",289]
[null,290,"Hexachlorobutadiene","87-68-3",3,0.02,0.21,null,null,null,null,null,null,null,"Y",290]
[null,291,"Hexachlorocyclopentadiene","77-47-4",4,0.01,0.11,null,null,null,null,null,null,null,"Y",291]
[null,292,"Hexachloroethane","67-72-1",3,1,9.6999999999999993,null,null,null,null,null,null,null,"Y",292]
[null,293,"Hexachloronaphthalene","1335-87-1",3,null,0.2,null,null,null,null,null,null,null,"Y",293]
[null,294,"Hexafluoroacetone","684-16-2",4,0.1,0.68,null,null,null,null,null,null,null,"Y",294]
[null,295,"Hexamethylene diisocyanate (HDI)","822-06-0",4,null,0.02,null,null,7.0000000000000007E-2,null,null,null,null,"Y",295]
[null,296,"Hexane (n-Hexane)","110-54-3",4,20,72,null,null,null,null,null,null,null,"Y",296]
[null,297,"Hexane, other isomers",null,"1C",500,1760,null,1000,3500,null,null,null,null,"Y",297]
[null,298,"sec-Hexyl acetate (1,3-Dimethyl butyl acetate)","108-84-9","1B",50,295,null,null,null,null,null,null,null,"Y",298]
[null,299,"Hexylene glycol (2-Methylpentane-2,4-diol)","107-41-5","1A",null,null,null,null,null,null,25,121,null,"N",299]
[null,300,"Hydrazine (Diamine)","302-01-2",4,0.01,1.2999999999999999E-2,null,null,null,null,null,null,null,"Y",300]
[null,301,"Hydrogen bromide","10035-10-6","1A",null,null,null,null,null,null,3,9.9,null,"N",301]
[null,302,"Hydrogen chloride (Hydrochloric acid)","7647-01-0","1A",null,null,null,null,null,null,5,7.5,null,"N",302]
[null,303,"Hydrogen cyanide (Hydrocyanic acid)","74-90-8","1A",null,null,null,null,null,null,10,11,null,"N",303]
[null,304,"Hydrogen fluoride (as F)","7664-39-3","1A",null,null,null,null,null,null,3,2.6,null,"N",304]
[null,305,"Hydrogen peroxide","7722-84-1",2,1,1.4,null,null,null,null,null,null,null,"Y",305]
[null,306,"Hydrogen selenide (as Se)","7783-07-5",4,0.05,0.16,null,null,null,null,null,null,null,"Y",306]
[null,307,"Hydrogen sulphide","7783-06-4","1C",10,14,null,15,21,null,null,null,null,"Y",307]
[null,308,"Hydrogenated terphenyls","37275-59-5",3,0.5,4.9000000000000004,null,null,null,null,null,null,null,"Y",308]
[null,309,"Hydroquinone (p-Dihydroxybenzene)","123-31-9",4,null,2,null,null,null,null,null,null,null,"Y",309]
[null,310,"2-Hydroxypropyl acrylate","999-61-1",4,0.5,2.8,null,null,null,null,null,null,null,"Y",310]
[null,311,"Indene","95-13-6",4,10,48,null,null,null,null,null,null,null,"Y",311]
[null,312,"Indium & compounds (as In)","7440-74-6",4,null,0.1,null,null,null,null,null,null,null,"Y",312]
[null,313,"Iodine","7553-56-2","1A",null,null,null,null,null,null,0.1,1,null,"N",313]
[null,314,"Iodoform","75-47-8",2,0.6,10,null,null,null,null,null,null,null,"Y",314]
[null,315,"Iron oxide fume (Fe2O3) (as Fe)","1309-37-1",3,null,5,null,null,null,null,null,null,null,"Y",315]
[null,316,"Iron pentacarbonyl (as Fe)","13463-40-6",2,0.1,0.23,null,0.2,0.45,null,null,null,null,"Y",316]
[null,317,"Iron salts, soluble (as Fe)",null,"1B",null,1,null,null,null,null,null,null,null,"Y",317]
[null,318,"Isoamyl acetate (Isopentyl acetate)","123-92-2","1B",50,270,null,100,541,null,null,null,null,"Y",318]
[null,319,"Isoamyl alcohol (3-Methylbutan-1-ol)","123-51-3",2,100,361,null,125,452,null,null,null,null,"Y",319]
[null,320,"Isobutyl acetate","110-19-0","1B",150,713,null,null,null,null,null,null,null,"Y",320]
[null,321,"Isobutyl alcohol (2-Methylpropan-1-ol; iso-Butanol)","78-83-1",2,50,152,null,null,null,null,null,null,null,"Y",{"$f":"B325","v":321}]
[null,322,"Isocyanates, all (as-NCO)",null,3,null,0.02,null,null,7.0000000000000007E-2,null,null,null,null,"Y",322]
[null,323,"Isooctyl alcohol","26952-21-6",2,50,266,null,null,null,null,null,null,null,"Y",323]
[null,324,"Isophorone (3,5,5-Trimethylcyclohex-2-enone)","78-59-1","1A",null,null,null,null,null,null,5,28,null,"N",324]
[null,325,"Isophorone diisocyanate (3-isocyanatomethyl-3,5,5-trimethylcyclohexyl isocyanate)","4098-71-9",3,null,0.02,null,null,7.0000000000000007E-2,null,null,null,null,"Y",325]
[null,326,"Isopropoxyethanol (2-(1-methylethoxy)-ethanol)","109-59-1",2,25,106,null,null,null,null,null,null,null,"Y",326]
[null,327,"Isopropyl acetate (Acetic acid, 1-methylethyl ester)","108-21-4",2,250,1040,null,310,1290,null,null,null,null,"Y",327]
[null,328,"Isopropyl alcohol (Propan-2-ol)","67-63-0",2,400,983,null,500,1230,null,null,null,null,"Y",328]
[null,329,"Isopropyl ether (Diisopropyl ether)","108-20-3","1B",250,1040,null,310,1300,null,null,null,null,"Y",329]
[null,330,"Isopropyl glycidyl ether (IGE, 2,3-Epoxypropyl isopropyl ether)","4016-14-2",3,50,238,null,75,356,null,null,null,null,"Y",330]
[null,331,"Isopropylamine (2-Aminopropane)","75-31-0",2,5,12,null,10,24,null,null,null,null,"Y",331]
[null,332,"N-Isopropylaniline","768-52-5",2,2,11,null,null,null,null,null,null,null,"Y",332]
[null,333,"Kaolin ","1332-58-7",3,null,10,null,null,null,null,null,null,null,"Y",333]
[null,334,"Ketene","463-51-4",2,0.5,0.86,null,1.5,2.6,null,null,null,null,"Y",334]
[null,335,"Lead arsenate (as Pb3(AsO4)2)","3687-31-8",4,null,0.15,null,null,null,null,null,null,null,"Y",335]
[null,336,"Lead chromate (as Cr) ","7758-97-6",3,null,0.05,null,null,null,null,null,null,null,"Y",336]
[null,337,"Lead, inorganic dusts & fumes (as Pb)","7439-92-1",3,null,0.05,null,null,null,null,null,null,null,"Y",337]
[null,338,"Lindane (Gammexane, gamma-Hexachlorocyclohexane)","58-89-9",4,8.0000000000000002E-3,0.1,null,null,null,null,null,null,null,"Y",338]
[null,339,"Lithium hydride","7580-67-8","1B",null,2.5000000000000001E-2,null,null,null,null,null,null,null,"Y",339]
[null,340,"LPG (liquified petroleum gas)","68476-85-7",4,1000,1800,null,null,null,null,null,null,null,"Y",340]
[null,341,"Magnesite ","546-93-0","1C",null,10,null,null,null,null,null,null,null,"Y",341]
[null,342,"Magnesium oxide (fume)","1309-48-4",2,null,10,null,null,null,null,null,null,null,"Y",342]
[null,343,"Malathion (Maldison)","121-75-5",4,null,10,null,null,null,null,null,null,null,"Y",343]
[null,344,"Maleic anhydride","108-31-6",4,0.25,1,null,null,null,null,null,null,null,"Y",344]
[null,345,"Manganese cyclopenta-dienyl tricarbonyl (as Mn)","12079-65-1",4,null,0.1,null,null,null,null,null,null,null,"Y",345]
[null,346,"Manganese, dust & compounds (as Mn)","7439-96-5",3,null,1,null,null,null,null,null,null,null,"Y",346]
[null,347,"Manganese, fume (as Mn) (Manganese tetroxide)","7439-96-5",3,null,1,null,null,3,null,null,null,null,"Y",347]
[null,348,"Man-Made Vitreous (Silicate) Fibres - Continuous glass filament",null,"1B",null,2,null,null,null,null,null,null,null,"Y",348]
[null,349,"Man-Made Vitreous (Silicate) Fibres - Glass wool",null,"1B",null,2,null,null,null,null,null,null,null,"Y",349]
[null,350,"Man-Made Vitreous (Silicate) Fibres - High Biopersistence MMVF",null,3,null,2,0.5,null,null,null,null,null,null,"Y",350]
[null,351,"Man-Made Vitreous (Silicate) Fibres - Low Biopersistence MMVF",null,"1B",null,2,null,null,null,null,null,null,null,"Y",351]
[null,352,"Man-Made Vitreous (Silicate) Fibres - Refractory Ceramic Fibres (RCF)",null,3,null,2,0.5,null,null,null,null,null,null,"Y",352]
[null,353,"Man-Made Vitreous (Silicate) Fibres - Rock (stone) wool",null,"1B",null,2,null,null,null,null,null,null,null,"Y",353]
[null,354,"Man-Made Vitreous (Silicate) Fibres - Slag wool",null,"1B",null,2,null,null,null,null,null,null,null,"Y",354]
[null,355,"Man-Made Vitreous (Silicate) Fibres - Special Purpose Glass Fibres",null,3,null,2,0.5,null,null,null,null,null,null,"Y",355]
[null,356,"Mercury, alkyl compounds (as Hg)",null,4,null,0.01,null,null,0.03,null,null,null,null,"Y",356]
[null,357,"Mercury, aryl compounds (as Hg)",null,4,null,0.1,null,null,null,null,null,null,null,"Y",357]
[null,358,"Mercury, elemental vapour (as Hg)","7439-97-6",4,3.0000000000000001E-3,2.5000000000000001E-2,null,null,null,null,null,null,null,"Y",358]
[null,359,"Mercury, inorganic divalent compounds (as Hg)","7439-97-6",4,3.0000000000000001E-3,2.5000000000000001E-2,null,null,null,null,null,null,null,"Y",359]
[null,360,"Mercury, inorganic monovalent compounds (as Hg)",null,4,null,0.1,null,null,null,null,null,null,null,"Y",360]
[null,361,"Mesityl oxide (4-Methylpent-3-en-2-one)","141-79-7","1B",15,60,null,25,100,null,null,null,null,"Y",361]
[null,362,"Methacrylic acid","79-41-4",2,20,70,null,null,null,null,null,null,null,"Y",362]
[null,363,"Methomyl (Lannate)","16752-77-5",4,null,2.5,null,null,null,null,null,null,null,"Y",363]
[null,364,"1-Methoxy-2-propanol acetate","108-65-6","1B",50,274,null,100,548,null,null,null,null,"Y",364]
[null,365,"Methoxychlor (2,2-bis(p-Methoxyphenyl)-1,1,1-trichloroethane; DMDT)","72-43-5",3,null,10,null,null,null,null,null,null,null,"Y",365]
[null,366,"2-Methoxyethanol (Methyl cellosolve, Methyl gylcol, Glycol monomethyl ether, Ethylene glycol monomethyl ether)","109-86-4",4,5,16,null,null,null,null,null,null,null,"Y",366]
[null,367,"2-Methoxyethyl acetate (Ethylene glycol monomethyl ether acetate, Glycol monomethyl ether acetate, Methyl glycol acetate, Methyl cellosolve acetate)","110-49-6",4,5,24,null,null,null,null,null,null,null,"Y",367]
[null,368,"(2-Methoxymethylethoxy) propenol (Dipropylene glycol (mono) methyl ether)","34590-94-8",2,50,308,null,null,null,null,null,null,null,"Y",368]
[null,369,"4-Methoxyphenol (Mequinol (INN))","150-76-5",4,null,5,null,null,null,null,null,null,null,"Y",369]
[null,370,"Methyl 2-cyanoacrylate (mecrilate)","137-05-3","1B",2,9.1,null,4,18,null,null,null,null,"Y",370]
[null,371,"Methyl acetate","79-20-9",2,200,606,null,250,757,null,null,null,null,"Y",371]
[null,372,"Methyl acetylene (Propyne)","74-99-7","1C",1000,1640,null,null,null,null,null,null,null,"Y",372]
[null,373,"Methyl acetylene-propadiene mixture (MAPP)","59355-75-8","1C",1000,1640,null,1250,2050,null,null,null,null,"Y",373]
[null,374,"Methyl acrylate (Acrylic acid, methyl ester)","96-33-3",3,10,35,null,null,null,null,null,null,null,"Y",374]
[null,375,"Methyl alcohol (Methanol)","67-56-1",2,200,262,null,250,328,null,null,null,null,"Y",375]
[null,376,"N-Methyl aniline","100-61-8",4,0.5,2.2000000000000002,null,null,null,null,null,null,null,"Y",376]
[null,377,"Methyl bromide (Bromomethane)","74-83-9",4,5,19,null,null,null,null,null,null,null,"Y",377]
[null,378,"Methyl chloride (Chloromethane)","74-87-3",4,50,103,null,100,207,null,null,null,null,"Y",378]
[null,379,"Methyl demeton (Demeton-O-methyl plus demeton-S-methyl; Metasystox)","8022-00-2",4,null,0.5,null,null,null,null,null,null,null,"Y",379]
[null,380,"Methyl ethyl ketone (MEK, 2-Butanone)","78-93-3",2,150,445,null,300,890,null,null,null,null,"Y",380]
[null,381,"Methyl ethyl ketone peroxide (2-Butanone, peroxide)","1338-23-4","1A",null,null,null,null,null,null,0.2,1.5,null,"N",381]
[null,382,"Methyl formate (Formic acid, methyl ester)","107-31-3",2,100,246,null,150,368,null,null,null,null,"Y",382]
[null,383,"Methyl hydrazine","60-34-4",4,0.01,1.9E-2,null,null,null,null,null,null,null,"Y",383]
[null,384,"Methyl iodide (Iodomethane)","74-88-4",4,2,12,null,null,null,null,null,null,null,"Y",384]
[null,385,"Methyl isoamyl ketone (Isoamyl methyl ketone; 5-Methyl-2-hexanone)","110-12-3","1B",50,234,null,null,null,null,null,null,null,"Y",{"$f":"B389","v":385}]
[null,386,"Methyl isobutyl carbinol (Methyl amyl alcohol; 4-methyl-2-Pentanol)","108-11-2",2,25,104,null,40,167,null,null,null,null,"Y",386]
[null,387,"Methyl isobutyl ketone (MIBK, Hexone, 4-Methyl-2-pentanone)","108-10-1",2,50,205,null,75,307,null,null,null,null,"Y",387]
[null,388,"Methyl isocyanate","624-83-9",4,null,0.02,null,null,7.0000000000000007E-2,null,null,null,null,"Y",388]
[null,389,"Methyl isopropyl ketone (3-Methyl-2-butanone)","563-80-4",4,200,705,null,null,null,null,null,null,null,"Y",389]
[null,390,"Methyl mercaptan (Methanethiol)","74-93-1",4,0.5,0.98,null,null,null,null,null,null,null,"Y",390]
[null,391,"Methyl methacrylate (Methacrylic acid, methyl ester)","80-62-6",4,50,208,null,100,416,null,null,null,null,"Y",391]
[null,392,"Methyl n-amyl ketone (2-Heptanone; Heptan-2-one)","110-43-0","1B",50,233,null,null,null,null,null,null,null,"Y",392]
[null,393,"Methyl n-butyl ketone (2-Hexanone)","591-78-6",3,5,20,null,null,null,null,null,null,null,"Y",393]
[null,394,"Methyl parathion","298-00-0",4,null,0.2,null,null,null,null,null,null,null,"Y",394]
[null,395,"Methyl propyl ketone (2-Pentanone)","107-87-9",2,200,705,null,250,881,null,null,null,null,"Y",395]
[null,396,"Methyl silicate (Tetramethyl orthosilicate)","681-84-5",2,1,6,null,null,null,null,null,null,null,"Y",396]
[null,397,"alpha-Methyl styrene (2-Phenylpropene)","98-83-9",4,50,242,null,100,483,null,null,null,null,"Y",397]
[null,398,"1-Methyl-2-pyrrolidone","872-50-4",4,25,103,null,75,309,null,null,null,null,"Y",398]
[null,399,"Methylacrylonitrile","126-98-7",4,1,2.7,null,null,null,null,null,null,null,"Y",399]
[null,400,"Methylal (Dimethoxymethane)","109-87-5","1B",1000,3110,null,null,null,null,null,null,null,"Y",400]
[null,401,"Methylamine ","74-89-5",2,10,13,null,null,null,null,null,null,null,"Y",401]
[null,402,"Methylcyclohexane","108-87-2",2,400,1610,null,null,null,null,null,null,null,"Y",402]
[null,403,"Methylcyclohexanol","25639-42-3",4,50,234,null,null,null,null,null,null,null,"Y",403]
[null,404,"o-Methylcyclohexanone","583-60-8","1B",50,229,null,75,344,null,null,null,null,"Y",404]
[null,405,"Methylcyclopentadienyl manganese tricarbonyl (as Mn)","12108-13-3",4,null,0.2,null,null,null,null,null,null,null,"Y",405]
[null,406,"4,4’-Methylene bis (2-chloroaniline) (MOCA, MBOCA, 2,2'-Dichloro-4,4'-methylenedianiline)","101-14-4",4,0.02,0.22,null,null,null,null,null,null,null,"Y",406]
[null,407,"Methylene bis (4-cyclo-hexylisocyanate)","5124-30-1",3,null,0.02,null,null,7.0000000000000007E-2,null,null,null,null,"Y",407]
[null,408,"Methylene bisphenyl isocyanate (MDI, Diphenylmethane diisocyanate)","101-68-8",4,null,0.02,null,null,7.0000000000000007E-2,null,null,null,null,"Y",408]
[null,409,"Methylene chloride (Dichloromethane)","75-09-2",4,50,174,null,null,null,null,null,null,null,"Y",409]
[null,410,"4,4'-Methylene dianiline (MDA, DADPM, DDM, p,p'-Diaminodiphenylmethane)","101-77-9",3,0.1,0.81,null,null,null,null,null,null,null,"Y",410]
[null,411,"5-Methylheptan-3-one (Ethyl amyl ketone)","541-85-5",2,10,53,null,20,107,null,null,null,null,"Y",411]
[null,412,"Methyl-tert butyl ether","1634-04-4",4,25,92,null,75,275,null,null,null,null,"Y",412]
[null,413,"Metribuzin (Sencor)","21087-64-9",2,null,5,null,null,null,null,null,null,null,"Y",413]
[null,414,"Mevinphos (Phosdrin)","7786-34-7",4,0.01,9.1999999999999998E-2,null,0.03,0.27,null,null,null,null,"Y",414]
[null,415,"Mica","12001-26-2",3,null,2.5,null,null,null,null,null,null,null,"Y",415]
[null,416,"Mineral turpentine",null,4,null,480,null,null,null,null,null,null,null,"Y",416]
[null,417,"Molybdenum, insoluble compounds (as Mo)","7439-98-7","1C",null,10,null,null,null,null,null,null,null,"Y",417]
[null,418,"Molybdenum, soluble compounds (as Mo)","7439-98-7","1C",null,5,null,null,null,null,null,null,null,"Y",418]
[null,419,"Monochloroacetic acid","79-11-8",2,0.3,1.2,null,null,null,null,null,null,null,"Y",419]
[null,420,"Monocrotophos (Azodrin)","6923-22-4",4,null,0.25,null,null,null,null,null,null,null,"Y",420]
[null,421,"Morpholine","110-91-8",2,20,71,null,null,null,null,null,null,null,"Y",421]
[null,422,"Naled (Dibrom; Dimethyl-1,2-dibromo-2,2-dichloroethylphosphate)","300-76-5",4,null,3,null,null,null,null,null,null,null,"Y",422]
[null,423,"Naphthalene","91-20-3",4,10,52,null,15,79,null,null,null,null,"Y",423]
[null,424,"Nickel carbonyl (as Ni) (Tetracarbonyl nickel)","13463-39-3",4,0.05,0.12,null,null,null,null,null,null,null,"Y",424]
[null,425,"Nickel dichloride","7718-54-9",3,null,0.1,null,null,null,null,null,null,null,"Y",425]
[null,426,"Nickel dinitrate","13138-45-9",3,null,0.1,null,null,null,null,null,null,null,"Y",426]
[null,427,"Nickel, metal","7440-02-0",3,null,1,null,null,null,null,null,null,null,"Y",427]
[null,428,"Nickel, powder","7440-02-0",3,null,1,null,null,null,null,null,null,null,"Y",428]
[null,429,"Nickel salt, nitric acid","14216-75-2",3,null,0.1,null,null,null,null,null,null,null,"Y",429]
[null,430,"Nickel, soluble compounds (as Ni)","7440-02-0",3,null,0.1,null,null,null,null,null,null,null,"Y",430]
[null,431,"Nickel sulphide roasting (fume & dust) (as Ni)",null,3,null,1,null,null,null,null,null,null,null,"Y",431]
[null,432,"Nicotine","54-11-5",2,null,0.5,null,null,null,null,null,null,null,"Y",432]
[null,433,"Nitrapyrin (N-Serve; 2-Chloro-6-(trichloromethyl) pyridine)","1929-82-4",3,null,10,null,null,20,null,null,null,null,"Y",433]
[null,434,"Nitric acid","7697-37-2",2,2,5.2,null,4,10,null,null,null,null,"Y",434]
[null,435,"Nitric oxide (Nitrogen monoxide)","10102-43-9",2,25,31,null,null,null,null,null,null,null,"Y",435]
[null,436,"p-Nitroaniline","100-01-6",4,null,3,null,null,null,null,null,null,null,"Y",436]
[null,437,"Nitrobenzene","98-95-3",4,1,5,null,null,null,null,null,null,null,"Y",437]
[null,438,"p-Nitrochlorobenzene (p-Chloronitrobenzene; 1-chloro-4-nitrobenzene)","100-00-5",4,0.1,0.64,null,null,null,null,null,null,null,"Y",438]
[null,439,"Nitroethane","79-24-3","1B",100,307,null,null,null,null,null,null,null,"Y",439]
[null,440,"Nitrogen dioxide","10102-44-0","1B",3,5.6,null,5,9.4,null,null,null,null,"Y",440]
[null,441,"Nitrogen trifluoride","7783-54-2",2,10,29,null,null,null,null,null,null,null,"Y",441]
[null,442,"Nitroglycerin (NG, Glyceryl trinitrate)","55-63-0",2,0.05,0.46,null,null,null,null,null,null,null,"Y",442]
[null,443,"Nitromethane","75-52-5",4,20,50,null,null,null,null,null,null,null,"Y",443]
[null,444,"1-Nitropropane","108-03-2",3,25,91,null,null,null,null,null,null,null,"Y",444]
[null,445,"2-Nitropropane","79-46-9",3,10,36,null,null,null,null,null,null,null,"Y",445]
[null,446,"2-Nitrotoluene","88-72-2",3,2,11,null,null,null,null,null,null,null,"Y",446]
[null,447,"3-Nitrotoluene","99-08-1",2,2,11,null,null,null,null,null,null,null,"Y",447]
[null,448,"4-Nitrotoluene","99-99-0",2,2,11,null,null,null,null,null,null,null,"Y",448]
[null,449,"Nitrous oxide (Dinitrogen monoxide, Laughing gas)","10024-97-2",3,25,45,null,null,null,null,null,null,null,"Y",{"$f":"B453","v":449}]
[null,450,"Nonane","111-84-2",2,200,1050,null,null,null,null,null,null,null,"Y",450]
[null,451,"Octachloronaphthalene","2234-13-1",3,null,0.1,null,null,0.3,null,null,null,null,"Y",451]
[null,452,"Octane","111-65-9",2,300,1400,null,375,1750,null,null,null,null,"Y",452]
[null,453,"Oil mist, refined mineral","8012-95-1",3,null,5,null,null,null,null,null,null,null,"Y",453]
[null,454,"Osmium tetroxide (as Os)","20816-12-0","1B",2.0000000000000001E-4,1.6000000000000001E-3,null,5.9999999999999995E-4,4.7000000000000002E-3,null,null,null,null,"Y",454]
[null,455,"Oxalic acid","144-62-7","1B",null,1,null,null,2,null,null,null,null,"Y",455]
[null,456,"2,2'-Oxybis[ethanol] (Diethylene glycol)","111-46-6",2,23,100,null,null,null,null,null,null,null,"Y",456]
[null,457,"Oxygen difluoride","7783-41-7","1A",null,null,null,null,null,null,0.05,0.11,null,"N",457]
[null,458,"Ozone","10028-15-6","1A",null,null,null,null,null,null,0.1,0.2,null,"N",458]
[null,459,"Paraffin wax (fume)","8002-74-2","1B",null,2,null,null,null,null,null,null,null,"Y",459]
[null,460,"Paraquat (respirable sizes) (Paraquat dichloride (ISO))","4685-14-7",4,null,0.1,null,null,null,null,null,null,null,"Y",460]
[null,461,"Parathion","56-38-2",4,null,0.1,null,null,null,null,null,null,null,"Y",461]
[null,462,"PCBs (42% Chlorine) (Polychlorinated biphenyls, Polychlorobiphenyls, Chlorobiphenyl)","53469-21-9?",3,null,1,null,null,2,null,null,null,null,"Y",462]
[null,463,"PCBs (54% Chlorine) (Chlorobiphenyl)","11097-69-1?",3,null,0.5,null,null,1,null,null,null,null,"Y",463]
[null,464,"Pentaborane","19624-22-7",2,5.0000000000000001E-3,1.2999999999999999E-2,null,1.4999999999999999E-2,3.9E-2,null,null,null,null,"Y",464]
[null,465,"Pentachloronaphthalene","1321-64-8",3,null,0.5,null,null,null,null,null,null,null,"Y",465]
[null,466,"Pentachloronitrobenzene (quintozene)","82-68-8",3,null,0.5,null,null,null,null,null,null,null,"Y",466]
[null,467,"Pentachlorophenol","87-86-5",4,null,0.5,null,null,null,null,null,null,null,"Y",467]
[null,468,"Pentaerythritol ","115-77-5","1C",null,10,null,null,null,null,null,null,null,"Y",468]
[null,469,"Pentane","109-66-0",2,600,1770,null,750,2210,null,null,null,null,"Y",469]
[null,470,"Perchloroethylene (Tetrachloroethylene)","127-18-4",4,50,340,null,150,1020,null,null,null,null,"Y",470]
[null,471,"Perchloromethyl mercaptan","594-42-3",2,0.1,0.76,null,null,null,null,null,null,null,"Y",471]
[null,472,"Perchloryl fluoride","7616-94-6",4,3,13,null,6,25,null,null,null,null,"Y",472]
[null,473,"Perfluoroisobutylene (Octafluoroisobutylene)","382-21-8","1A",null,null,null,null,null,null,0.01,8.2000000000000003E-2,null,"N",473]
[null,474,"Perlite dust ","93763-70-3","1C",null,10,null,null,null,null,null,null,null,"Y",474]
[null,475,"Petrol (gasoline)","8002-05-9",4,null,900,null,null,null,null,null,null,null,"Y",475]
[null,476,"Phenol","108-95-2",4,1,4,null,null,null,null,null,null,null,"Y",476]
[null,477,"Phenothiazine","92-84-2",3,null,5,null,null,null,null,null,null,null,"Y",477]
[null,478,"Phenyl ether (vapour) (Diphenyl ether)","101-84-8","1B",1,7,null,2,14,null,null,null,null,"Y",478]
[null,479,"Phenyl glycidyl ether (PGE; Phenyl-2,3-epoxypropyl ether; Oxirane, (phenoxymethyl)-)","122-60-1",3,1,6.1,null,null,null,null,null,null,null,"Y",479]
[null,480,"Phenyl mercaptan (Benzenethiol)","108-98-5","1B",0.5,2.2999999999999998,null,null,null,null,null,null,null,"Y",480]
[null,481,"m-Phenylenediamine (1,3-Benzenediamine)","108-45-2",4,null,0.1,null,null,null,null,null,null,null,"Y",481]
[null,482,"o-Phenylenediamine (1,2-Benzenediamine)","95-54-5",4,null,0.1,null,null,null,null,null,null,null,"Y",482]
[null,483,"p-Phenylenediamine (1,4-Benzenediamine)","106-50-3",4,null,0.1,null,null,null,null,null,null,null,"Y",483]
[null,484,"Phenylhydrazine","100-63-0",4,0.1,0.44,null,null,null,null,null,null,null,"Y",484]
[null,485,"Phenylphosphine","638-21-1","1A",null,null,null,null,null,null,0.05,0.23,null,"N",485]
[null,486,"Phorate (Thimet)","298-02-2",4,null,0.05,null,null,0.2,null,null,null,null,"Y",486]
[null,487,"Phosgene (Carbonyl chloride)","75-44-5",2,0.02,0.08,null,0.06,0.25,null,null,null,null,"Y",487]
[null,488,"Phosphine","7803-51-2",2,0.3,0.42,null,1,1.4,null,null,null,null,"Y",488]
[null,489,"Phosphoric acid (Orthophosphoric acid)","7664-38-2","1B",null,1,null,null,3,null,null,null,null,"Y",489]
[null,490,"Phosphorus (yellow)","7723-14-0","1B",null,0.1,null,null,null,null,null,null,null,"Y",490]
[null,491,"Phosphorus oxychloride (Phosphoryl trichloride)","10025-87-3",4,0.1,0.63,null,null,null,null,null,null,null,"Y",491]
[null,492,"Phosphorus pentachloride","10026-13-8","1B",0.1,0.85,null,null,null,null,null,null,null,"Y",492]
[null,493,"Phosphorus pentasulphide (Diphosphorous pentasulphide)","1314-80-3","1B",null,1,null,null,3,null,null,null,null,"Y",493]
[null,494,"Phosphorus trichloride","7719-12-2","1B",0.2,1.1000000000000001,null,0.5,2.8,null,null,null,null,"Y",494]
[null,495,"Phthalic anhydride","85-44-9",4,1,6.1,null,null,null,null,null,null,null,"Y",495]
[null,496,"m-Phthalodinitrile","626-17-5","1C",null,5,null,null,null,null,null,null,null,"Y",496]
[null,497,"Picloram (Tordon)","1918-02-1","1C",null,10,null,null,null,null,null,null,null,"Y",497]
[null,498,"Picric acid (2,4,6-Trinitrophenol)","88-89-1",3,null,0.1,null,null,null,null,null,null,null,"Y",498]
[null,499,"Pindone (Pival; 2-Pivalyl-1,3-indandione)","83-26-1",3,null,0.1,null,null,null,null,null,null,null,"Y",499]
[null,500,"Piperazine dihydrochloride","142-64-3",4,null,5,null,null,null,null,null,null,null,"Y",500]
[null,501,"Piperidine","110-89-4","1B",1,3.5,null,null,null,null,null,null,null,"Y",501]
[null,502,"Platinum, metal","7440-06-4",3,null,1,null,null,null,null,null,null,null,"Y",502]
[null,503,"Platinum, soluble salts (as Pt)",null,3,null,2E-3,null,null,null,null,null,null,null,"Y",503]
[null,504,"Portland cement ","65997-15-1","1B",null,10,null,null,null,null,null,null,null,"Y",504]
[null,505,"Potassium hydroxide","1310-58-3","1A",null,null,null,null,null,null,null,2,null,"N",505]
[null,506,"Potassium Persulfate","7727-21-1",2,null,null,null,null,null,null,null,0.01,null,"N",506]
[null,507,"Precipitated silica ","112926-00-8","1C",null,10,null,null,null,null,null,null,null,"Y",507]
[null,508,"Propane-1,2-diol total: (vapour & particulates)","57-55-6",2,150,474,null,null,null,null,null,null,null,"Y",508]
[null,509,"Propane-1,2-diol: particulates only","57-55-6",2,null,10,null,null,null,null,null,null,null,"Y",509]
[null,510,"Propargyl alcohol (Prop-2-yn-1-ol)","107-19-7","1B",1,2.2999999999999998,null,null,null,null,null,null,null,"Y",510]
[null,511,"beta-Propiolactone","57-57-8",4,0.5,1.5,null,null,null,null,null,null,null,"Y",511]
[null,512,"Propionic acid","79-09-4",2,10,30,null,null,null,null,null,null,null,"Y",512]
[null,513,"Propoxur (PHC, Baygon, Arprocarb)","114-26-1",4,null,0.5,null,null,null,null,null,null,null,"Y",{"$f":"B517","v":513}]
[null,514,"Propranolol","525-66-6",2,0.188,2,null,0.56499999999999995,6,null,null,null,null,"Y",514]
[null,515,"n-Propyl acetate","109-60-4","1B",200,835,null,250,1040,null,null,null,null,"Y",515]
[null,516,"Propyl alcohol (Propan-1-ol)","71-23-8",2,200,492,null,250,614,null,null,null,null,"Y",516]
[null,517,"n-Propyl nitrate","627-13-4",2,25,107,null,40,172,null,null,null,null,"Y",517]
[null,518,"Propylene dichloride (1,2-Dichloropropane)","78-87-5",4,75,347,null,110,508,null,null,null,null,"Y",518]
[null,519,"Propylene glycol dinitrate","6423-43-4",4,0.05,0.34,null,null,null,null,null,null,null,"Y",519]
[null,520,"Propylene glycol monomethyl ether (1-Methoxypropan-2-ol)","107-98-2",4,100,369,null,150,553,null,null,null,null,"Y",520]
[null,521,"Propylene imine (2-methylaziridine)","75-55-8",4,2,4.7,null,null,null,null,null,null,null,"Y",521]
[null,522,"Propylene oxide (1,2-Epoxypropane; Oxirane, methyl-)","75-56-9",4,20,48,null,null,null,null,null,null,null,"Y",522]
[null,523,"Pyrethrum (Pyrethrins (ISO))","8003-34-7?",3,null,5,null,null,null,null,null,null,null,"Y",523]
[null,524,"Pyridine","110-86-1",3,5,16,null,null,null,null,null,null,null,"Y",524]
[null,525,"Quartz (respirable dust)","14808-60-7",3,null,0.05,null,null,null,null,null,null,null,"Y",525]
[null,526,"Quinone (p-Benzoquinone)","106-51-4","1B",0.1,0.44,null,null,null,null,null,null,null,"Y",526]
[null,527,"Resorcinol (m-Dihydroxybenzene)","108-46-3",2,10,45,null,20,90,null,null,null,null,"Y",527]
[null,528,"Rhodium, insoluble compounds (as Rh)","7440-16-6","1B",null,1,null,null,null,null,null,null,null,"Y",528]
[null,529,"Rhodium, metal","7440-16-6","1B",null,1,null,null,null,null,null,null,null,"Y",529]
[null,530,"Rhodium, soluble compounds (as Rh)","7440-16-6",3,null,0.01,null,null,null,null,null,null,null,"Y",530]
[null,531,"Ronnel (Fenchlorphos)","299-84-3",4,null,10,null,null,null,null,null,null,null,"Y",531]
[null,532,"Rosin core solder pyrolysis products (as formaldehyde)",null,3,null,0.1,null,null,null,null,null,null,null,"Y",532]
[null,533,"Rotenone (commercial)","83-79-4",2,null,5,null,null,null,null,null,null,null,"Y",533]
[null,534,"Rouge dust ",null,"1C",null,10,null,null,null,null,null,null,null,"Y",534]
[null,535,"Selenium compounds (as Se) excluding hydrogen selenide","7782-49-2",4,null,0.1,null,null,null,null,null,null,null,"Y",535]
[null,536,"Selenium hexafluoride (as Se)","7783-79-1",4,0.05,0.16,null,null,null,null,null,null,null,"Y",536]
[null,537,"Sesone (2,4-DES sodium; Crag Herbicide; Sodium 2,4-dichloro phenoxyethyl sulfate)","136-78-7",3,null,10,null,null,null,null,null,null,null,"Y",537]
[null,538,"Silica – Amorphous - Fume (thermally generated)(respirable dust)",null,3,null,2,null,null,null,null,null,null,null,"Y",538]
[null,539,"Silica – Crystalline (respirable dust)","7631-86-9",3,null,0.05,null,null,null,null,null,null,null,"Y",539]
[null,540,"Silica gel ","112926-00-8","1C",null,10,null,null,null,null,null,null,null,"Y",540]
[null,541,"Silica, fused","60676-86-0",3,null,0.1,null,null,null,null,null,null,null,"Y",541]
[null,542,"Silicon ","7440-21-3","1C",null,10,null,null,null,null,null,null,null,"Y",542]
[null,543,"Silicon carbide ","409-21-2","1C",null,10,null,null,null,null,null,null,null,"Y",543]
[null,544,"Silicon tetrahydride (Silane)","7803-62-5",2,5,6.6,null,null,null,null,null,null,null,"Y",544]
[null,545,"Silver, metal","7440-22-4",3,null,0.1,null,null,null,null,null,null,null,"Y",545]
[null,546,"Silver, soluble compounds (as Ag)","7440-22-4",3,null,0.01,null,null,null,null,null,null,null,"Y",546]
[null,547,"Soapstone ","14378-12-2",3,null,6,null,null,null,null,null,null,null,"Y",547]
[null,548,"Soapstone (respirable dust)","14378-12-2",3,null,3,null,null,null,null,null,null,null,"Y",548]
[null,549,"Sodium azide ","26628-22-8","1A",null,null,null,null,null,null,0.11,0.3,null,"N",549]
[null,550,"Sodium bisulphite (Sodium hydrogen sulphite)","7631-90-5","1B",null,5,null,null,null,null,null,null,null,"Y",550]
[null,551,"Sodium fluoroacetate","62-74-8",2,null,0.05,null,null,0.15,null,null,null,null,"Y",551]
[null,552,"Sodium hydroxide","1310-73-2","1A",null,null,null,null,null,null,null,2,null,"N",552]
[null,553,"Sodium metabisulphite (Disodium disulphite)","7681-57-4","1B",null,5,null,null,null,null,null,null,null,"Y",553]
[null,554,"Sodium persulfate","7775-27-1","1A",null,null,null,null,null,null,null,0.01,null,"N",554]
[null,555,"Starch ","9005-25-8",3,null,10,null,null,null,null,null,null,null,"Y",555]
[null,556,"Stearates ",null,"1C",null,10,null,null,null,null,null,null,null,"Y",556]
[null,557,"Stibine (Antimony hydride)","7803-52-3",4,0.1,0.51,null,null,null,null,null,null,null,"Y",557]
[null,558,"Strychnine","57-24-9",2,null,0.15,null,null,null,null,null,null,null,"Y",558]
[null,559,"Styrene, monomer (Phenylethylene, Vinyl benzene)","100-42-5",4,50,213,null,100,426,null,null,null,null,"Y",559]
[null,560,"Subtilisins (Proteolytic enzymes as 100% pure crystalline enzyme)","1395-21-7","1A",null,null,null,null,null,null,null,6.0000000000000002E-5,null,"N",560]
[null,561,"Sucrose ","57-50-1","1C",null,10,null,null,null,null,null,null,null,"Y",561]
[null,562,"Sulfotep (TEDP; O,O,O,O-Tetraethyl dithiopyrophosphate)","3689-24-5",4,7.0000000000000001E-3,0.1,null,null,null,null,null,null,null,"Y",562]
[null,563,"Sulphur dioxide","7446-09-5","1B",2,5.2,null,5,13,null,null,null,null,"Y",563]
[null,564,"Sulphur hexafluoride","2551-62-4","1C",1000,5970,null,null,null,null,null,null,null,"Y",564]
[null,565,"Sulphur monochloride (Disulphur dichloride)","10025-67-9","1A",null,null,null,null,null,null,1,5.5,null,"N",565]
[null,566,"Sulphur pentafluoride (Disulphur decafluoride)","5714-22-7","1A",null,null,null,null,null,null,0.01,0.1,null,"N",566]
[null,567,"Sulphur tetrafluoride","7783-60-0","1A",null,null,null,null,null,null,0.1,0.44,null,"N",567]
[null,568,"Sulphuric acid","7664-93-9",4,null,1,null,null,3,null,null,null,null,"Y",568]
[null,569,"Sulphuryl fluoride","2699-79-8",3,5,21,null,10,42,null,null,null,null,"Y",569]
[null,570,"Sulprofos (Bolstar)","35400-43-2",4,null,1,null,null,null,null,null,null,null,"Y",570]
[null,571,"2,4,5-T (2,4,5-Trichlorophenoxyacetic acid)","93-76-5","1C",null,10,null,null,null,null,null,null,null,"Y",571]
[null,572,"Talc (containing no asbestos fibres)","14807-96-6",3,null,2.5,null,null,null,null,null,null,null,"Y",572]
[null,573,"Tantalum, metal & oxide dusts","7440-25-7","1C",null,5,null,null,null,null,null,null,null,"Y",573]
[null,574,"Tellurium & compounds (as Te)","13494-80-9",4,null,0.1,null,null,null,null,null,null,null,"Y",574]
[null,575,"Tellurium hexafluoride (as Te)","7783-80-4",2,0.02,0.1,null,null,null,null,null,null,null,"Y",575]
[null,576,"Temephos (Abate)","3383-96-8",4,null,10,null,null,null,null,null,null,null,"Y",576]
[null,577,"TEPP (Tetraethyl pyrophosphate)","107-49-3",4,4.0000000000000001E-3,4.7E-2,null,null,null,null,null,null,null,"Y",{"$f":"B581","v":577}]
[null,578,"Terphenyls","26140-60-3","1A",null,null,null,null,null,null,0.5,4.7,null,"N",578]
[null,579,"1,1,2,2-Tetrabromoethane (Acetylene tetrabromide)","79-27-6",4,1,14,null,null,null,null,null,null,null,"Y",579]
[null,580,"1,1,2,2-Tetrachloro-1,2-difluoroethane","76-12-0",4,500,4170,null,null,null,null,null,null,null,"Y",580]
[null,581,"1,1,1,2-Tetrachloro-2,2-difluoroethane","76-11-9",4,500,4170,null,null,null,null,null,null,null,"Y",581]
[null,582,"1,1,2,2-Tetrachloroethane","79-34-5",4,1,6.9,null,null,null,null,null,null,null,"Y",582]
[null,583,"Tetrachloronaphthalene","1335-88-2",3,null,2,null,null,null,null,null,null,null,"Y",583]
[null,584,"Tetraethyl lead (as Pb)","78-00-2",4,null,0.1,null,null,null,null,null,null,null,"Y",584]
[null,585,"1,1,1,2-Tetrafluoroethane (HFC 134a)","811-97-2","1C",1000,4240,null,null,null,null,null,null,null,"Y",585]
[null,586,"Tetrahydrofuran","109-99-9",4,100,295,null,null,null,null,null,null,null,"Y",586]
[null,587,"Tetramethyl lead (as Pb)","75-74-1",4,null,0.15,null,null,null,null,null,null,null,"Y",587]
[null,588,"Tetramethyl succinonitrile","3333-52-6",2,0.5,2.8,null,null,null,null,null,null,null,"Y",588]
[null,589,"Tetranitromethane ","509-14-8",4,1,8,null,null,null,null,null,null,null,"Y",589]
[null,590,"Tetrasodium pyrophosphate","7722-88-5","1B",null,5,null,null,null,null,null,null,null,"Y",590]
[null,591,"Tetryl (2,4,6-Trinitrophenylmethylnitramine; N-Methyl-N-2,4,6-tetranitroaniline)","479-45-8",3,null,1.5,null,null,null,null,null,null,null,"Y",591]
[null,592,"Thallium, soluble compounds (as Tl)","7440-28-0",3,null,0.1,null,null,null,null,null,null,null,"Y",592]
[null,593,"4,4'-Thiobis (6-tert-butyl-m-cresol)","96-69-5","1C",null,10,null,null,null,null,null,null,null,"Y",593]
[null,594,"Thioglycolic acid (Mercaptoacetic acid)","68-11-1",2,1,3.8,null,null,null,null,null,null,null,"Y",594]
[null,595,"Thionyl chloride (thionyl dichloride)","7719-09-7","1A",null,null,null,null,null,null,1,4.9000000000000004,null,"N",595]
[null,596,"Thiram (Tetramethyl thiuram disulphide)","137-26-8",3,null,1,null,null,null,null,null,null,null,"Y",596]
[null,597,"Tin, metal","7440-31-5",3,null,2,null,null,null,null,null,null,null,"Y",597]
[null,598,"Tin, organic compounds (as Sn)","7440-31-5",3,null,0.1,null,null,0.2,null,null,null,null,"Y",598]
[null,599,"Tin, oxide & inorganic compounds, except SnH4 (as Sn)","7440-31-5",3,null,2,null,null,null,null,null,null,null,"Y",599]
[null,600,"Titanium dioxide ","13463-67-7","1C",null,10,null,null,null,null,null,null,null,"Y",600]
[null,601,"Toluene ","108-88-3",4,50,191,null,150,574,null,null,null,null,"Y",601]
[null,602,"Toluene-2,4-diisocyanate (TDI; 4-methyl-m-phenylene diisocyanate)","584-84-9",4,null,0.02,null,null,7.0000000000000007E-2,null,null,null,null,"Y",602]
[null,603,"m-Toluidine","108-44-1",4,2,8.8000000000000007,null,null,null,null,null,null,null,"Y",603]
[null,604,"o-Toluidine","95-53-4",4,2,8.8000000000000007,null,null,null,null,null,null,null,"Y",604]
[null,605,"p-Toluidine","106-49-0",4,2,8.8000000000000007,null,null,null,null,null,null,null,"Y",605]
[null,606,"Tributyl phosphate (Phosphoric acid, tributyl ester)","126-73-8",4,0.2,2.2000000000000002,null,null,null,null,null,null,null,"Y",606]
[null,607,"1,1,2-Trichloro-1,2,2-trifluoroethane (Fluorocarbon 113, Freon 113)","76-13-1",2,1000,7670,null,1250,9590,null,null,null,null,"Y",607]
[null,608,"Trichloroacetic acid (TCA)","76-03-9",2,1,6.7,null,null,null,null,null,null,null,"Y",608]
[null,609,"1,2,4-Trichlorobenzene","120-82-1","1A",null,null,null,null,null,null,5,37,null,"N",609]
[null,610,"1,1,1-Trichloroethane (Methyl chloroform)","71-55-6",2,100,555,null,200,1110,null,null,null,null,"Y",610]
[null,611,"1,1,2-Trichloroethane","79-00-5",4,10,55,null,null,null,null,null,null,null,"Y",611]
[null,612,"Trichloroethylene (Ethene, trichloro)","79-01-6",4,10,54,null,40,216,null,null,null,null,"Y",612]
[null,613,"Trichlorofluoromethane (Fluorocarbon 11, Freon 11, Fluorotrichloromethane)","75-69-4","1A",null,null,null,null,null,null,1000,5620,null,"N",613]
[null,614,"Trichloronaphthalene","1321-65-9",3,null,5,null,null,null,null,null,null,null,"Y",614]
[null,615,"1,2,3-Trichloropropane","96-18-4",4,10,60,null,null,null,null,null,null,null,"Y",615]
[null,616,"Tridymite (respirable dust)","15468-32-3",3,null,0.05,null,null,null,null,null,null,null,"Y",616]
[null,617,"Triethanolamine (Ethanol, 2,2',2''-nitrilotris-)","102-71-6",2,null,5,null,null,null,null,null,null,null,"Y",617]
[null,618,"Triethylamine (N,N-Diethylethanamine)","121-44-8",4,2,8,null,4,17,null,null,null,null,"Y",618]
[null,619,"Trifluorobromomethane (Fluorocarbon 13B1, Bromotrifluoromethane)","75-63-8","1C",1000,6090,null,null,null,null,null,null,null,"Y",619]
[null,620,"Triglycidylisocyanurate (TGIC; Araldite PT 810)","2451-62-9",3,null,0.08,null,null,null,null,null,null,null,"Y",620]
[null,621,"Trimellitic anhydride (Benzene-1,2,4-tricarboxylic acid-1,2-anhydride)","552-30-7",3,5.0000000000000001E-3,3.9E-2,null,null,null,null,null,null,null,"Y",621]
[null,622,"Trimethyl benzene","25551-13-7",3,25,123,null,null,null,null,null,null,null,"Y",622]
[null,623,"Trimethyl phosphite (Phosphorous acid, trimethyl ester)","121-45-9","1B",2,10,null,null,null,null,null,null,null,"Y",623]
[null,624,"Trimethylamine ","75-50-3",2,10,24,null,15,36,null,null,null,null,"Y",624]
[null,625,"2,4,6-Trinitrotoluene (TNT)","118-96-7",3,null,0.5,null,null,null,null,null,null,null,"Y",625]
[null,626,"Triorthocresyl phosphate (Tri o-tolylphosphate)","78-30-8",4,null,0.1,null,null,null,null,null,null,null,"Y",626]
[null,627,"Triphenyl amine","603-34-9","1C",null,5,null,null,null,null,null,null,null,"Y",627]
[null,628,"Triphenyl phosphate","115-86-6",4,null,3,null,null,null,null,null,null,null,"Y",628]
[null,629,"Tripoli (Microcrystalline Silica)","1317-95-9",3,null,0.05,null,null,null,null,null,null,null,"Y",629]
[null,630,"Tungsten, insoluble compounds (as W)","7440-33-7","1C",null,5,null,null,10,null,null,null,null,"Y",630]
[null,631,"Tungsten, soluble compounds (as W)","7440-33-7",2,null,1,null,null,3,null,null,null,null,"Y",631]
[null,632,"Turpentine (wood)","8006-64-2",4,100,557,null,null,null,null,null,null,null,"Y",632]
[null,633,"Uranium (natural), soluble & insoluble compounds (as H)","7440-61-1",3,null,0.2,null,null,0.6,null,null,null,null,"Y",633]
[null,634,"n-Valeraldehyde","110-62-3","1B",50,176,null,null,null,null,null,null,null,"Y",634]
[null,635,"Vanadium (as V2O5) (divanadium pentaoxide), (respirable dust & fume)","1314-62-1",4,null,0.05,null,null,null,null,null,null,null,"Y",635]
[null,636,"Vegetable oil mists (except castor oil, cashew nut or similar irritant oils)",null,"1C",null,10,null,null,null,null,null,null,null,"Y",636]
[null,637,"Vinyl acetate ","108-05-4",4,10,35,null,20,70,null,null,null,null,"Y",637]
[null,638,"Vinyl bromide (Bromoethylene)","593-60-2",3,5,22,null,null,null,null,null,null,null,"Y",638]
[null,639,"Vinyl chloride, monomer (Chloroethylene; Ethene, chloro)","75-01-4",3,5,13,null,null,null,null,null,null,null,"Y",639]
[null,640,"Vinyl cyclohexene dioxide (1,2-Epoxy-4-(epoxy-ethyl)-cyclohexane)","106-87-6",3,10,57,null,null,null,null,null,null,null,"Y",640]
[null,641,"Vinyl toluene (Methyl styrene)","25013-15-4","1B",50,242,null,100,483,null,null,null,null,"Y",{"$f":"B645","v":641}]
[null,642,"Vinylidene chloride (1,1-Dichloroethylene)","75-35-4",3,5,20,null,20,79,null,null,null,null,"Y",642]
[null,643,"Warfarin","81-81-2",4,null,0.1,null,null,null,null,null,null,null,"Y",643]
[null,644,"Welding fumes (not otherwise classified)",null,2,null,5,null,null,null,null,null,null,null,"Y",644]
[null,645,"White spirits (Stoddard solvent)","8052-41-3",4,null,790,null,null,null,null,null,null,null,"Y",645]
[null,646,"Wood dust (certain hardwoods such as beech & oak)",null,3,null,1,null,null,null,null,null,null,null,"Y",646]
[null,647,"Wood dust (soft wood)",null,3,null,5,null,null,10,null,null,null,null,"Y",647]
[null,648,"Xylene (o-, m-, p- isomers)",null,2,80,350,null,150,655,null,null,null,null,"Y",648]
[null,649,"m-Xylene-alpha,alpha'-diamine (m-Xylylendiamine; 1,3-Benzenedimethanamine)","1477-55-0","1A",null,null,null,null,null,null,null,0.1,null,"N",649]
[null,650,"Xylidine (Dimethylaminobenzene, Aminodimethyl benzene)","1300-73-8",3,0.5,2.5,null,null,null,null,null,null,null,"Y",650]
[null,651,"Yttrium, metal & compounds (as Y)","7440-65-5",3,null,1,null,null,null,null,null,null,null,"Y",651]
[null,652,"Zinc chloride (fume)","7646-85-7",2,null,1,null,null,2,null,null,null,null,"Y",652]
[null,653,"Zinc chromates (as Cr) [11103-86-9, 13530-65-9, 37300-23-5]","13530-65-9",4,null,0.01,null,null,null,null,null,null,null,"Y",653]
[null,654,"Zinc oxide (dust) ","1314-13-2","1C",null,10,null,null,null,null,null,null,null,"Y",654]
[null,655,"Zinc oxide (fume)","1314-13-2",2,null,5,null,null,10,null,null,null,null,"Y",655]
[null,656,"Zirconium compounds (as Zr)","7440-67-7","1C",null,5,null,null,10,null,null,null,null,"Y",656]

{"sheet":"Tree","index":5,"n_rows":0,"n_cols":0,"rows_kept":0,"cut":false,"hidden":false,"merged":[]}

{"sheet":"Qc","index":6,"n_rows":0,"n_cols":0,"rows_kept":0,"cut":false,"hidden":false,"merged":[]}

{"sheet":"Rep","index":7,"n_rows":0,"n_cols":0,"rows_kept":0,"cut":false,"hidden":false,"merged":[]}

{"sheet":"BS","index":8,"n_rows":0,"n_cols":0,"rows_kept":0,"cut":false,"hidden":false,"merged":[]}

{"sheet":"Feuil1","index":9,"n_rows":0,"n_cols":0,"rows_kept":0,"cut":false,"hidden":true,"merged":[]}

{"sheet":"Histo","index":10,"n_rows":24,"n_cols":15,"rows_kept":24,"cut":false,"hidden":false,"merged":[]}
[]
[]
[]
[]
[]
[]
[null,null,"Workbook Main parameters",null,null,null,null,"Québec Model parameters",null,null,null,null,"Brief & Scala Model parameters"]
[]
[null,null,"Version :","Version 1,4 : July 2019",null,null,null,"Sub. Choice Line#",63,null,null,null,"Schedule BS ?",1]
[]
[null,null,"Authors :","This file has been created by Daniel Drolet and Ian Firth",null,null,null,"CAS",{"$f":"CAS_Ron(choix1a,TableAjustement)","v":"7726-95-6"},null,null,null,"Sub. Choice Line#",2]
[]
[null,null,"ZOOM :",3,null,null,null,"ADJ or NOT",{"$f":"IF(OR(AdjCodeQc=\"1A\",AdjCodeQc=\"1B\",AdjCodeQc=\"1C\",No_TWA_QC=\"No TWA\"),\"No Adjustment\",\"\")","v":"No Adjustment"},null,null,null,"Yes or No",{"$f":"IF(ISBLANK(choix1aBS),0,VLOOKUP(choix1aBS,TableAjustement,14,FALSE))","v":"Y"}]
[]
[null,null,"Answer # 1",1,null,null,null,"TWA or NOT",{"$f":"IF(ISBLANK(choix1a),\"\",IF(VLOOKUP(choix1a,TableAjustement,14,FALSE)=\"N\",\"No TWA\",\"\"))","v":""},null,null,null,"ADJ or NOT",{"$f":"IF(Factor_BS=1,\"No Adjustment\",\"\")","v":""}]
[]
[null,null,"Answer # 2",null,null,null,null,null,null,null,null,null,"TWA or NOT",{"$f":"IF(ISBLANK(choix1aBS),\"\",IF(VLOOKUP(choix1aBS,TableAjustement,14,FALSE)=\"N\",\"No TWA\",\"\"))","v":""}]
[]
[null,null,"Model Selected",{"$f":"IF(OR(Answer_One=1,Answer_two=TRUE()),\"Qc\",\"B&S\")","v":"Qc"},null,null,null,null,null,null,null,null,"CAS",{"$f":"CAS_Ron(choix1aBS,TableAjustement)","v":"64-19-7"}]
[]
[null,null,"Excel Version :",16]
[]
[]
[null,null,{"$f":"version","v":"Version 1,4 : July 2019"},null,null,null,null,null,null,null,null,null,null,null,{"$f":"authors","v":"This file has been created by Daniel Drolet and Ian Firth"}]

{"sheet":"Cat","index":11,"n_rows":14,"n_cols":5,"rows_kept":14,"cut":false,"hidden":false,"merged":[]}
[]
[]
[]
[]
[]
[null,"Adj Cat.","Category","Type of adjustment","ADJ Cat Rom"]
[null,"1A","Substances regulated by a ceiling value","No adjustment","I-a"]
[null,"1B","Irritating or malodorous substances","No adjustment","I-b"]
[null,"1C","Simple asphyxiants, substances presenting a safety risk or a very low health risk, whose half-life is less than 4 hours. Technological limitations","No adjustment","I-c"]
[null,"2","Substances that produce effects following short-term exposure","Daily adjustment","II"]
[null,"3","Substances that produce effects following long-term exposure","Weekly adjustment","III"]
[null,"4","Substances that produce effects following a short- or long-term exposure","Daily or weekly adjustment\n( the more conservative of the two)","IV"]
[]
[null,{"$f":"version","v":"Version 1,4 : July 2019"},null,null,{"$f":"authors","v":"This file has been created by Daniel Drolet and Ian Firth"}]

{"sheet":"Path","index":12,"n_rows":28,"n_cols":4,"rows_kept":28,"cut":false,"hidden":false,"merged":[]}
[]
[]
[]
[]
[]
[null,"Pathology\nCode","Organisation","Pathology description"]
[null,1,"OSHA","Carcinogenic effect detected in humans- (C1 designation in RQWE)"]
[null,2,"OSHA","Carcinogenic effect suspected in humans- (C2 designation in RQWE);  mutagenic effect"]
[null,3,"OSHA","Effects following long-term exposure - systems other than nervous, respiratory, blood and reproductive"]
[null,4,"OSHA","Effects following short-term exposure - other than teratogenic, narcotic, respiratory, methemoglobinizing"]
[null,5,"OSHA","Effects on reproductive system and on pre- and post-natal development"]
[null,6,"OSHA","Effects on nervous system - cholinesterase inhibition"]
[null,7,"OSHA","Effects on nervous system - other than narcosis and cholinesterase inhibition"]
[null,8,"OSHA","Effects on the nervous system - Narcosis"]
[null,9,"OSHA","Respiratory effects - Asthma"]
[null,10,"OSHA","Respiratory effects following long-term exposure, other than asthma"]
[null,11,"OSHA","Respiratory effects following short-term exposure"]
[null,12,"OSHA","Hematologic effects - other than methemoglobinizing effects"]
[null,13,"OSHA","Methemoglobinizing hematological effects"]
[null,14,"OSHA","Marked irritation of the skin and/or mucous membranes"]
[null,15,"OSHA","Moderate irritation of the skin and/or mucous membranes"]
[null,16,"OSHA","Slight irritation of the skin and/or mucous membranes"]
[null,17,"OSHA","Simple asphyxia"]
[null,18,"OSHA","Explosive or flammable substances, or those with another safety risk"]
[null,19,"OSHA","Substances with a slight health risk"]
[null,20,"OSHA","Smelly substances with a very slight health risk"]
[]
[null,{"$f":"version","v":"Version 1,4 : July 2019"},null,{"$f":"authors","v":"This file has been created by Daniel Drolet and Ian Firth"}]

{"sheet":"structure","index":13,"n_rows":27,"n_cols":8,"rows_kept":27,"cut":false,"hidden":false,"merged":[]}
[]
[]
[]
[]
[]
[]
[]
[]
[]
[]
[]
[]
[]
[]
[]
[]
[]
[]
[]
[]
[]
[]
[]
[]
[]
[]
[null,{"$f":"version","v":"Version 1,4 : July 2019"},null,null,null,null,null,{"$f":"authors","v":"This file has been created by Daniel Drolet and Ian Firth"}]

{"sheet":"2018_SWA WES List","index":14,"n_rows":662,"n_cols":22,"rows_kept":662,"cut":false,"hidden":true,"merged":[]}
[]
[null,null,"Safe Work Australia (SWA) TWA WES Values with Adjustment Codes *(APRIL 2019)"]
[]
[]
[]
[null,null,"#","SWA chemical names","CAS","TWA (ppm)","TWA (mg/m³)","TWA (f/mL)","STEL (ppm)","STEL (mg/m³)","Peak (ppm)","Peak (mg/m³)","Current Adj","Proposed Adj","Quebec Model Adj","Carcinogen Category","Notices","Hazard Category","Rationale for change or comment","ACGIH Documentation (2016)","UWHA Code","Changed"]
[null,null,1,"Acetaldehyde ","75-07-0",20,36,null,50,91,null,null,"1B",4,"1A","Carc. 2 ","-","Acute toxicity – category 4\nCarcinogenicity – category 2\nGerm cell mutagenicity – category 2\nSpecific target organ toxicity (STOT - single exposure) – category 3\nEye irritation – category 2A","Has health effects after both short and long term exposure.  In addition, ACGIH has a Ceiling value, but SWA has no Peak","Eye & upper respiratory tract (URT) irritation; ceiling value assigned","1A","Y"]
[null,null,2,"Acetic acid","64-19-7",10,25,null,15,37,null,null,"1B","1B","1B","-","-","Skin corrosion – category 1A",null,"URT & eye irr; pulm func","1B"]
[null,null,3,"Acetic anhydride","108-24-7",null,null,null,null,null,5,21,"1A","1A","1B","-","-","Acute toxicity – category 4\nSkin corrosion – category 1B",null,"Eye & URT irr (plus burns)","1B"]
[null,null,4,"Acetone","67-64-1",500,1185,null,1000,2375,null,null,"1C",2,"1C","-","-","Eye irritation – category 2A\nSTOT (single exposure) – category 3","Acute effect is drowsiness, Classifying as 2 allows WES reduction for longer shifts which seems appropriate as it already has a very high WES","URT & eye irr; CNS impairment","1B","Y"]
[null,null,5,"Acetonitrile","75-05-8",40,67,null,60,101,null,null,2,2,"2","-","Sk","Acute toxicity – category 4\nEye irritation – category 2",null,"LRT irr; skin notation",4]
[null,null,6,"Acetylsalicylic acid (Aspirin)","50-78-2",null,5,null,null,null,null,null,2,2,"2","-","-","-",null,"Skin, eye & GI irr; blood effects",4]
[null,null,7,"Acrolein","107-02-8",0.1,0.23,null,0.3,0.69,null,null,"1B","1A","1B","-","-","Acute toxicity – category 1\nAcute toxicity – category 2\nAcute toxicity – category 3\nSkin corrosion – category 1B","Is an intense irritant, 1B is more designed for mild irritants. ACGIH rationale for ceiling seems sound.","Eye & URT irr; pulm edema; pulm emphysema; ceiling value assigned","1A","Y"]
[null,null,8,"Acrylamide (Acrylaldehyde)","79-06-1",null,0.03,null,null,null,null,null,3,3,"3","Carc. 1B","Sk:Sen","Carcinogenicity – category 1B\nGerm cell mutagenicity – category 1B\nReproductive toxicity – category 2\nAcute toxicity – category 3\nSTOT (repeated exposure) – category 1\nAcute toxicity – category 4\nEye irritation – category 2A\nSkin irritation – category 2\nSkin sensitisation – category 1\nSTOT (repeated exposure) – category 2",null,"CNS impairment; skin notation",4]
[null,null,9,"Acrylic acid","79-10-7",2,5.9,null,null,null,null,null,4,4,"1B","-","Sk","Acute toxicity – category 4\nAcute toxicity – category 3\nSkin corrosion – category 1A",null,"URT & eye irr; pulmonary function effect; skin notation",4]
[null,null,10,"Acrylonitrile (Vinyl cyanide)","107-13-1",2,4.3,null,null,null,null,null,4,4,"3","Carc. 1B","Sk:Sen","Carcinogenicity – category 1B\nAcute toxicity – category 3\nSTOT (single exposure) – category 3\nSkin irritation – category 2\nEye damage – category 1",null,"CNS impairment; LRT irr; skin notation",4]
[null,null,11,"Aldrin","309-00-2",null,0.25,null,null,null,null,null,4,4,"4","Carc. 2","Sk","Carcinogenicity – category 2\nAcute toxicity – category 3\nSTOT (repeated exposure) – category 1",null,"CNS impairment; liver & kidney damage",4]
[null,null,12,"Allyl alcohol","107-18-6",2,4.8,null,4,9.5,null,null,2,2,"1B","-","Sk","Acute toxicity – category 3\nSTOT (single exposure) – category 3\nEye irritation – category 2\nSkin irritation – category 2",null,"Eye & URT irr; skin notation",4]
[null,null,13,"Allyl chloride (3-Chloro-1-propene)","107-05-1",1,3,null,2,6,null,null,4,4,"3","Carc. 2","-","Acute toxicity – category 4\nGerm cell mutagenicity – category 2\nEye irritation – category 2A\nSkin irritation – category 2\nSTOT (repeated exposure) – category 2\nReproductive toxicity – category 2",null,"Eye & URT irr; liver & kidney damage",4]
[null,null,14,"Allyl glycidyl ether (AGE) (Allyl 2,3-epoxypropyl ether)","106-92-3",5,23,null,10,47,null,null,4,4,"1B","Carc. 2","Sk:Sen","Acute toxicity – category 4\nSkin irritation – category 2\nEye damage – category 1\nSkin sensitisation – category 1\nGerm cell mutagenicity – category 2\nCarcinogenicity – category 2\nReproductive toxicity – category 2\nSTOT (single exposure) – category 3",null,"URT irr; dermatitis; eye & skin irr","1B"]
[null,null,15,"Allyl propyl disulfide","2179-59-1",2,12,null,3,18,null,null,"1B","1B","1B","-","- ","-",null,"Eye & URT irr","1B"]
[null,null,16,"Aluminium (metal dust)","7429-90-5",null,10,null,null,null,null,null,"1C","1C","1C","-","- ","-",null,"Pneumoconiosis; LRT irr; neurotoxicity","1C"]
[null,null,17,"Aluminium (welding fumes) (as Al)","7429-90-5",null,5,null,null,null,null,null,"1C","1C","1C","-","- ","-",null,"Pneumoconiosis; LRT irr; neurotoxicity","1B"]
[null,null,18,"Aluminium oxide (alpha-Alumina (Al2O3))","1344-28-1",null,10,null,null,null,null,null,"1C","1C","1C","-","- ","-",null,"Pneumoconiosis; LRT irr; neurotoxicity","1C"]
[null,null,19,"Aluminium, alkyls (NOC) (as Al)","7429-90-5",null,2,null,null,null,null,null,"1B","1B","1B","-","- ","-",null,null,"1B"]
[null,null,20,"Aluminium, pyro powders (as Al)","7429-90-5",null,5,null,null,null,null,null,"1C","1C","1C","-","- ","-",null,null,3]
[null,null,21,"Aluminium, soluble salts (as Al)","7429-90-5",null,2,null,null,null,null,null,"1B","1B","1B","-","- ","-",null,null,"1B"]
[null,null,22,"2-Aminopyridine (2-Pyridylamine)","504-29-0",0.5,2,null,null,null,null,null,2,2,"2","-","- ","-",null,null,2]
[null,null,23,"Amitrole (3-Amino-1,2,4-triazole)","61-82-5",null,0.2,null,null,null,null,null,3,3,"3","-","-","Reproductive toxicity – category 2\nSTOT(repeated exposure) – category 2",null,null,3]
[null,null,24,"Ammonia","7664-41-7",25,17,null,35,24,null,null,"1B","1B","1B","-","- ","Acute toxicity – category 4\nSkin corrosion – category 1",null,"Eye damage; URT irr","1B"]
[null,null,25,"Ammonium chloride (fume)","12125-02-9",null,10,null,null,20,null,null,"1B","1B","1B","-","- ","Acute toxicity – category 4\nEye irritation – category 2A",null,"Eye & URT irr","1C"]
[null,null,26,"Ammonium perfluorooctanoate ","3825-26-1",null,0.1,null,null,null,null,null,3,3,"3","-","- ","Acute toxicity – category 3\nCarcinogenicity – category 2\nEye irritation – category 2A\nSTOT (repeated exposure) – category 1\nReproductive toxicity – category 1B",null,"Liver damage",4]
[null,null,27,"Ammonium Persulfate","7727-54-0",null,null,null,null,null,null,0.01,2,"1A",null,"-","Sen","Acute toxicity – category 4\nSkin irritation – category 2\nEye irritation – category 2A\nRespiratory sensitisation – category 1\nSkin sensitisation – category 1\nSTOT (single exposure) – category 3","Could be changed to Cat 2 based on GHS sensitisation and STOT classification, but there is no TWA WES.  It is an irritant with only a peak value, hence should be a Cat 1A.","Skin irr; (NIOSH Int Chem Safety Card - URT irr,  sore throat, wheezing)","1B","Y"]
[null,null,28,"Ammonium sulphamate (Ammate)","7773-06-0",null,10,null,null,null,null,null,"1B","1B","1B","-","-","-",null,null,"1C"]
[null,null,29,"n-Amyl acetate (Pentyl acetate)","628-63-7",50,270,null,100,541,null,null,"1B","1B","1B","-","-","-",null,"URT irr (narcosis & developmental effects at high levels)","1B"]
[null,null,30,"sec-Amyl acetate (1-Methylbutyl acetate)","626-38-0",50,270,null,100,541,null,null,"1B","1B","1B","-","-","-",null,"URT irr (narcosis & developmental effects at high levels)","1B"]
[null,null,31,"Aniline & homologues","62-53-3",2,7.6,null,null,null,null,null,4,4,"1C","Carc. 2","Sk:Sen","Carcinogenicity – category 2\nGerm cell mutagenicity – category 2\nAcute toxicity – category 3\nSTOT (repeated exposure) – category 1\nEye damage – category 1\nSkin sensitisation – category 1",null,"MeHb-emia; skin notation",4]
[null,null,32,"Anisidine (o-, p- isomers) (Methoxyaniline)","29191-52-4",0.1,0.5,null,null,null,null,null,4,3,"2","Carc. 1B","Sk","-","Only long-term exposure effects are indicated.","MeHb-emia; skin notation",3,"Y"]
[null,null,33,"Antimony & compounds (as Sb)","7440-36-0",null,0.5,null,null,null,null,null,3,3,"3","-","-","-",null,"Skin & URT irr",4]
[null,null,34,"Antimony trioxide, handling and use (as Sb)","1309-64-4",null,0.5,null,null,null,null,null,3,3,"3","Carc. 2","-","Carcinogenicity – category 2",null,"Lung cancer; pneumoconiosis","1C"]
[null,null,35,"ANTU (1-Naphthylthiourea)","86-88-4",null,0.3,null,null,null,null,null,2,4,"2","Carc. 2","-","Acute toxicity – category 2\nCarcinogenicity – category 2","Has both acute and chronic (cancer) effects.","Thyroid effects; nausea; skin notation",2,"Y"]
[null,null,36,"Arsenic & soluble compounds (as As)","7440-38-2",null,0.05,null,null,null,null,null,3,4,"3","Some are Carc. 1","Some are Sen","Acute toxicity – category 3\nCarcinogenicity – category 1A\nGerm cell mutagenicity – category 2\nSTOT (repeated exposure) – category 2","Has acute (Toxic if swallowed - GHS) as well as chronic (cancer) effects. Half life is 4-6 hours (Mayomedical labs) or 10 hours (ATSDR).","Lung cancer",3,"Y"]
[null,null,37,"Arsine","7784-42-1",0.05,0.16,null,null,null,null,null,4,4,"4","-","-","Acute toxicity – category 1\nCarcinogenicity – category 1A\nSTOT (repeated exposure) – category 1",null,"PNS & vascular system impairment; kidney & liver impairment",4]
[null,null,38,"Asbestos - Any mixture of commercial species, or where the composition is unknown","1332-21-4",null,null,0.1,null,null,null,null,3,3,null,"Carc. 1A","-","-",null,"Pneumoconiosis; lung cancer; mesothelioma",3]
[null,null,39,"Asbestos - Amosite ","12172-73-5",null,null,0.1,null,null,null,null,3,3,"3","Carc. 1A","-","Carcinogenicity – category 1A\nSTOT (repeated exposure) – category 1",null,"Pneumoconiosis; lung cancer; mesothelioma",3]
[null,null,40,"Asbestos - Chrysotile ","12001-29-5",null,null,0.1,null,null,null,null,3,3,"3","Carc. 1A","-","Carcinogenicity – category 1A\nSTOT (repeated exposure) – category 1",null,"Pneumoconiosis; lung cancer; mesothelioma",3]
[null,null,41,"Asbestos - Crocidolite ","12001-28-4",null,null,0.1,null,null,null,null,3,3,"3","Carc. 1A","-","Carcinogenicity – category 1A\nSTOT (repeated exposure) – category 1",null,"Pneumoconiosis; lung cancer; mesothelioma",3]
[null,null,42,"Asbestos - Other forms ",null,null,null,0.1,null,null,null,null,3,3,"3","Carc. 1A","-","-",null,"Pneumoconiosis; lung cancer; mesothelioma",3]
[null,null,43,"Atrazine","1912-24-9",null,5,null,null,null,null,null,2,3,"2","-","Sen","STOT (repeated exposure) – category 2\nSkin sensitisation – category 1","Appears to have only long-term effects.","Haematological, reproductive & developmental effects",3,"Y"]
[null,null,44,"Azinphos-methyl (Guthion)","86-50-0",null,0.2,null,null,null,null,null,4,4,"4","-","Sk:Sen","Acute toxicity – category 2\nAcute toxicity – category 3\nSkin sensitisation – category 1",null,"Cholinesterase inhib; skin notation & sensitiser",2]
[null,null,45,"Barium sulphate ","7727-43-7",null,10,null,null,null,null,null,3,3,"3","-","-","-",null,"Pneumoconiosis",3]
[null,null,46,"Barium, soluble compounds (as Ba)","7440-39-3",null,0.5,null,null,null,null,null,2,2,"2","-","- ","-",null,"Eye, skin & GI irr; muscular stimulant",4]
[null,null,47,"Benomyl (Benlate)","17804-35-2",0.84,10,null,null,null,null,null,4,4,"1C","-","Sen","Germ cell mutagenicity – category 1B\nReproductive toxicity – category 1B\nSTOT (single exposure) – category 3\nSkin irritation – category 2\nSkin sensitisation – category 1",null,"URT irr; male repro & testicular damage; embryo/foetal damage","1C"]
[null,null,48,"Benzene","71-43-2",1,3.2,null,null,null,null,null,3,3,"3","Carc. 1A","-","Carcinogenicity – category 1A\nGerm cell mutagenicity – category 1B\nSTOT (repeated exposure) – category 1\nEye irritation – category 2\nSkin irritation – category 2",null,null,3]
[null,null,49,"Benzoyl peroxide (Dibenzoyl peroxide)","94-36-0",null,5,null,null,null,null,null,"1B","1B","1B","-","Sen","Eye irritation – category 2A\nSkin sensitisation – category 1","Could be changed to Cat 2 based on GHS sensitisation.  Principal hazards are due to flammable and explosive properties.","URT & skin irr","1B","M"]
[null,null,50,"Benzyl chloride (alpha-Chlorotoluene)","100-44-7",1,5.2,null,null,null,null,null,4,4,"4","-","-","Acute toxicity – category 4\nAcute toxicity – category 3\nCarcinogenicity – category 1B\nEye damage – category 1\nSTOT (single exposure) – category 3\nSTOT (repeated exposure) – category 2\nSkin sensitisation – category 1\nSkin irritation – category 2 ",null,"Eye, skin & URT irr","1B"]
[null,null,51,"Beryllium & compounds","7440-41-7",null,2E-3,null,null,null,null,null,3,3,"3","Some are Carc. 1","Some are Sen","Acute toxicity – category 1\nCarcinogenicity – category 1B\nSTOT (single exposure) – category 3\nSTOT (repeated exposure) – category 1\nRespiratory sensitisation – category 1\nSkin sensitisation – category 1",null,"Beryllium sens; berylliosis",3]
[null,null,52,"Biphenyl (Diphenyl, Phenylbenzene)","92-52-4",0.2,1.3,null,null,null,null,null,3,4,"1B","-","-","Eye irritation – category 2\nSTOT (single exposure) – category 3\nSkin irritation – category 2","ACGIH TLV and GHS hazard category point to short-term effects related to irritation mainly, but toxic effects occur at higher doses and there is some indication of carcinogenicity (CCRIS).","Potential for irritation of nasal mucosa & respiratory difficulties in rats & mice",3,"Y"]
[null,null,53,"Bismuth telluride (Dibismuth tritelluride)","1304-82-1",null,10,null,null,null,null,null,"1C","1C","1C","-","-","-",null,"Lung damage - reversible & mild",3]
[null,null,54,"Bismuth telluride, Se-doped","1304-82-1",null,5,null,null,null,null,null,3,3,3,"-","-","-",null,"Lung damage","1C"]
[null,null,55,"Bitumen fumes (Asphalt (petroleum))","8052-42-4",null,5,null,null,null,null,null,4,4,"3","-","-","-",null,"Eye & URT irr",3]
[null,null,56,"Borates, tetra, sodium salts (anhydrous) (Disodium tetraborate anhydrous)","1330-43-4",null,1,null,null,null,null,null,"1B","1B","1B","-","-","Reproductive toxicity – category 1B","Could be Cat 3, but rReproductive effects for males occurs at much higher levels than the current exposure standard.","URT irr","1B"]
[null,null,57,"Borates, tetra, sodium salts (decahydrate) (Disodium tetraborate decahydrate, Borax)","1303-96-4",null,5,null,null,null,null,null,"1B","1B","1B","-","-","Reproductive toxicity – category 1B","Could be Cat 3, but rReproductive effects for males occurs at much higher levels than the current exposure standard.","URT irr","1B"]
[null,null,58,"Borates, tetra, sodium salts (pentahydrate) (Disodium tetraborate pentahydrate)","12179-04-3",null,1,null,null,null,null,null,"1B","1B","1B","-","-","Reproductive toxicity – category 1B","Could be Cat 3, but rReproductive effects for males occurs at much higher levels than the current exposure standard.","URT irr","1B"]
[null,null,59,"Boron oxide (Diboron trioxide)","1303-86-2",null,10,null,null,null,null,null,"1B","1B","1B","-","-","Reproductive toxicity – category 1B","Could be Cat 3, but rReproductive effects for males occurs at much higher levels than the current exposure standard.","Eye & URT irr","1B"]
[null,null,60,"Boron tribromide","10294-33-4",null,null,null,null,null,1,10,"1A","1A","1A","-","-","Acute toxicity – category 2\nSkin corrosion – category 1A",null,"Resp tract irritant; pneumonitis","1A"]
[null,null,61,"Boron trifluoride","7637-07-2",null,null,null,null,null,1,2.8,"1A","1A","1A","-","-","Acute toxicity – category 2\nSkin corrosion – category 1A",null,"Resp tract irritant; pneumonitis","1A"]
[null,null,62,"Bromacil","314-40-9",1,11,null,null,null,null,null,3,3,"3","-","-","-",null,"Thyroid eff","1C"]
[null,null,63,"Bromine","7726-95-6",0.1,0.66,null,0.3,2,null,null,"1B","1B","1B","-","-","Acute toxicity – category 2\nSkin corrosion – category 1A",null,"URT & LRT irr; lung damage","1B"]
[null,null,64,"Bromine pentafluoride","7789-30-2",0.1,0.72,null,null,null,null,null,"1B","1B","1B","-","-","-",null,"Eye, skin & URT irr","1B"]
[null,null,65,"Bromoform (Tribromomethane)","75-25-2",0.5,5.2,null,null,null,null,null,4,4,"4","-","Sk","Acute toxicity – category 3\nAcute toxicity – category 4\nEye irritation – category 2\nSkin irritation – category 2",null,"Liver damage; URT & eye irr",3]
[null,null,66,"1,3-Butadiene ","106-99-0",10,22,null,null,null,null,null,3,3,"3","Carc. 1A","-","Carcinogenicity – category 1A\nGerm cell mutagenicity – category 1B\nReproductive toxicity – category 2",null,"Cancer",3]
[null,null,67,"Butane","106-97-8",800,1900,null,null,null,null,null,"1C","1C","1C","-","- ","-",null,"CNS impairment",2]
[null,null,68,"2-Butoxyethanol (Butyl cellosolve, Butyl glycol, Ethylene glycol)","111-76-2",20,96.9,null,50,242,null,null,"1B","1B","3","-","Sk ","Acute toxicity – category 4\nEye irritation – category 2\nSkin irritation – category 2","ACGIH no longer recommend a skin notation.","Eye & URT irr","1B"]
[null,null,69,"2-Butoxyethyl acetate","112-07-2",20,133,null,50,333,null,null,"1B","1B",null,"-","Sk ","Acute toxicity – category 4","ACGIH no longer recommend a skin notation.  UK HSE documentation - Eye & URT irr.","Haemolisis (in animal tests)"]
[null,null,70,"n-Butyl acetate","123-86-4",150,713,null,200,950,null,null,"1B",2,"1B","-","- ","STOT (single exposure) – category 3","Acute effect is drowsiness, category 2 recommended using same logic as acetone.","Eye & URT irr","1B","Y"]
[null,null,71,"sec-Butyl acetate","105-46-4",200,950,null,null,null,null,null,"1B",2,"1B","-","- ","-","Acute effect is drowsiness, category 2 recommended using same logic as acetone.","Eye & URT irr","1B","Y"]
[null,null,72,"tert-Butyl acetate","540-88-5",200,950,null,null,null,null,null,"1B",2,"1B","-","- ","STOT (single exposure) – category 3","Acute effect is drowsiness, category 2 recommended using same logic as acetone.","Eye & URT irr","1B","Y"]
[null,null,73,"n-Butyl acrylate (Acrylic acid, n-butyl ester)","141-32-2",1,5,null,5,26,null,null,4,4,"1B","-","Sen","Acute toxicity – category 4\nEye irritation – category 2A\nSkin irritation – category 2\nSTOT (single exposure) – category 3\nSkin sensitisation – category 1",null,"Skin, eye & URT irr",4]
[null,null,74,"n-Butyl alcohol (n-Butanol)","71-36-3",null,null,null,null,null,50,152,"1A","1A","1A","-","Sk ","Acute toxicity – category 4\nSkin irritation – category 2\nSTOT (single exposure) – category 3\nEye damage – category 1","Possibly a Cat 2 given GHS STOT hazard category, but remains a Cat 1A given it has only a peak value.","Eye & URT irr","1A","M"]
[null,null,75,"sec-Butyl alcohol (sec-Butanol, Butan-2-ol)","78-92-2",100,303,null,null,null,null,null,2,2,"2","-","- ","Eye irritation – category 2\nSTOT (single exposure) – category 3",null,"URT irr; CNS impair",2]
[null,null,76,"tert-Butyl alcohol (tert-Butanol, 2-Methylpropan-2-ol)","75-65-0",100,303,null,150,455,null,null,2,2,"2","-","- ","Acute toxicity – category 4\nEye damage – category 1\nSTOT (single exposure) – category 3",null,"CNS impairment",2]
[null,null,77,"tert-Butyl chromate (as CrO3)","1189-85-1",null,null,null,null,null,null,0.1,"1A","1A","1A","-","Sk ","-",null,"LRT & skin irr","1A"]
[null,null,78,"n-Butyl glycidyl ether (BGE) (1-Butoxy-2,3-epoxypropane, Butyl-2,3-epoxypropyl ether)","2426-08-6",25,133,null,null,null,null,null,3,3,"3","Carc. 2","Sen ","Acute toxicity – category 4\nSkin irritation – category 2\nEye irritation – category 2A\nSkin sensitisation – category 1\nGerm cell mutagenicity – category 2\nCarcinogenicity – category 2\nReproductive toxicity – category 2\nSTOT (single exposure) – category 3",null,"Repro damage",2]
[null,null,79,"n-Butyl lactate","138-22-7",5,30,null,null,null,null,null,"1B","1B","1B","-","- ","-",null,"Headache; URT irr","1B"]
[null,null,80,"Butyl mercaptan (Butanethiol)","109-79-5",0.5,1.8,null,null,null,null,null,"1B","1B","1B","-","- ","-",null,"URT irr",2]
[null,null,81,"Butylamine","109-73-9",null,null,null,null,null,5,15,"1A","1A","1A","-","Sk ","Acute toxicity – category 4\nSkin corrosion – category 1A",null,"Headache; URT & eye irr; skin notation","1A"]
[null,null,82,"o-sec-Butylphenol","89-72-5",5,31,null,null,null,null,null,"1B","1B","1B","-","Sk ","-",null,"Eye, skin & URT irr",2]
[null,null,83,"p-tert-Butyltoluene ","98-51-1",10,61,null,20,121,null,null,3,3,"3","-","- ","-",null,"Eye & URT irr; nausea",4]
[null,null,84,"Cadmium and compounds (as Cd)","7440-43-9",null,0.01,null,null,null,null,null,3,3,"3","Some are Carc. 1","Some are Sen","Carcinogenicity – category 1B\nGerm cell mutagenicity – category 2\nReproductive toxicity – category 2\nAcute toxicity – category 2\nSTOT (repeated exposure) – category 1","Remains as Cat 3 as biological half life is long.","Kidney damage",3]
[null,null,85,"Caesium hydroxide","21351-79-1",null,2,null,null,null,null,null,"1B","1B","1B","-","- ","-",null,"URT, skin & eye irr","1B"]
[null,null,86,"Calcium carbonate (Limestone, Marble)","471-34-1",null,10,null,null,null,null,null,"1C","1C","1C","-","- ","-",null,null,"1C"]
[null,null,87,"Calcium cyanamide (Calcium carbimide)","156-62-7",null,0.5,null,null,null,null,null,"1B",2,"1B","-","- ","Acute toxicity – category 4\nSTOT (single exposure) – category 3\nEye damage – category 1","Should be a Cat 2 given GHS STOT hazard category and Cat 1 eye damage.","Eye & URT irr",4,"Y"]
[null,null,88,"Calcium hydroxide (slaked lime)","1305-62-0",null,5,null,null,null,null,null,"1B","1B","1B","-","- ","Skin irritation – category 2\nEye damage – category 1",null,"Eye, skin & URT irr","1B"]
[null,null,89,"Calcium oxide (lime)","1305-78-8",null,2,null,null,null,null,null,"1B",2,"1B","-","- ","Skin irritation – category 2\nEye damage – category 1\nSTOT (single exposure) – category 3","Possibly a Cat 2 given GHS STOT hazard category.","URT irr","1B","Y"]
[null,null,90,"Calcium silicate ","1344-95-2",null,10,null,null,null,null,null,"1C","1C","1C","-","- ","-",null,"Pneumoconiosis; pulmonary function effects","1C"]
[null,null,91,"Calcium sulphate (Gypsum, Plaster of Paris)","7778-18-9",null,10,null,null,null,null,null,"1C","1C","1C","-","- ","-",null,"Nasal symptoms","1C"]
[null,null,92,"Camphor, synthetic (Bornan-2-one)","76-22-2",2,12,null,3,19,null,null,"1B","1B","1B","-","- ","-",null,"Eye & URT irr; anosmia",4]
[null,null,93,"e-Caprolactam (dust and vapour) (1,6-Hexanelactam, Hexahydro-2H-azepin-2-one)","105-60-2",null,10,null,null,20,null,null,"1B","1B","1B","-","- ","Acute toxicity – category 4\nEye irritation – category 2\nSTOT (single exposure) – category 3\nSkin irritation – category 2","Possibly a Cat 2 given GHS STOT hazard category.","URT irr",2,"M"]
[null,null,94,"Caprolactam (dust)","105-60-2",null,1,null,null,3,null,null,"1B","1B","1B","-","- ","Acute toxicity – category 4\nEye irritation – category 2\nSTOT (single exposure) – category 3\nSkin irritation – category 2","Possibly a Cat 2 given GHS STOT hazard category.","URT irr",2,"M"]
[null,null,95,"Captafol (Difolatan)","2425-06-1",null,0.1,null,null,null,null,null,4,4,"3","Carc. 1B","Sk:Sen","Carcinogenicity – category 1B\nSkin sensitisation – category 1",null,"Skin irr & dermatitis; skin notation & sensitisation",4]
[null,null,96,"Captan","133-06-2",null,0.5,null,null,null,null,null,4,4,"3","Carc. 2","Sk:Sen","Acute toxicity – category 3\nEye damage – category 1\nSkin sensitisation – category 1\nGerm cell mutagenicity – category 1B\nCarcinogenicity – category 2",null,"Skin irr","1B"]
[null,null,97,"Carbaryl (Sevin)","63-25-2",null,5,null,null,null,null,null,4,4,"4","Carc. 2","-","Carcinogenicity – category 2\nAcute toxicity – category 4\nAcute toxicity – category 4",null,"Cholinesterase inhib; male repro damage; embryo damage",4]
[null,null,98,"Carbofuran (Furadan)","1563-66-2",null,0.1,null,null,null,null,null,4,4,"4","-","-","Acute toxicity – category 2\nAcute toxicity – category 2",null,"Cholinesterase inhib",4]
[null,null,99,"Carbon black","1333-86-4",null,3,null,null,null,null,null,3,3,"3","-","-","STOT (repeated exposure) – category 2",null,"Bronchitis","1C"]
[null,null,100,"Carbon dioxide","124-38-9",5000,9000,null,30000,54000,null,null,"1C","1C","1C","-","-","-",null,"Asphyxia","1C"]
[null,null,101,"Carbon dioxide in coal mines","124-38-9",12500,22500,null,30000,54000,null,null,"1C","1C",null,"-","-","-",null,null,"1C"]
[null,null,102,"Carbon disulphide","75-15-0",10,31,null,null,null,null,null,4,4,"4","-","Sk","Acute toxicity – category 4\nEye irritation – category 2A\nSkin irritation – category 2\nSTOT (repeated exposure) – category 1\nReproductive toxicity – category 2",null,"PNS impair",4]
[null,null,103,"Carbon monoxide ","630-08-0",30,34,null,null,null,null,null,4,4,"4",null,"-","Reproductive toxicity – category 1A\nAcute toxicity – category 3\nSTOT (repeated exposure) – category 1",null,"COHb-emia",2]
[null,null,104,"Carbon tetrabromide (Tetrabromomethane)","558-13-4",0.1,1.4,null,0.3,4.0999999999999996,null,null,4,4,"4","-","-","-",null,"Liver damage; eye, URT & skin irr",4]
[null,null,105,"Carbon tetrachloride (Tetrachloromethane)","56-23-5",0.1,0.63,null,null,null,null,null,4,4,"4","Carc. 2","Sk","Carcinogenicity – category 2\nAcute toxicity – category 3\nSTOT (repeated exposure) – category 1",null,"Liver damage",4]
[null,null,106,"Carbonyl fluoride","353-50-4",2,5.4,null,5,13,null,null,4,4,"4","-","-","-",null,null,4]
[null,null,107,"Catechol (Pyrocatechol, o-Dihydroxybenzene, 1,2-Benzenediol)","120-80-9",5,23,null,null,null,null,null,4,4,"4","-","-","Acute toxicity – category 3\nCarcinogenicity – category 2\nGerm cell mutagenicity – category 2\nEye irritation – category 2A\nSkin sensitisation – category 1",null,null,4]
[null,null,108,"Cellulose (paper fibre) ","9004-34-6",null,10,null,null,null,null,null,"1C","1C","1C","-","-","-",null,"URT irr","1C"]
[null,null,109,"Chlordane","57-74-9",null,0.5,null,null,null,null,null,4,4,"4","Carc. 2","Sk","Carcinogenicity – category 2\nAcute toxicity – category 4",null,null,4]
[null,null,110,"Chlorinated camphene (Camphechlor)","8001-35-2",null,0.5,null,null,1,null,null,4,4,"4","Carc. 2","Sk","Carcinogenicity – category 2\nAcute toxicity – category 3\nAcute toxicity – category 4\nSTOT (single exposure) – category 3\nSkin irritation – category 2 ",null,null,4]
[null,null,111,"Chlorinated diphenyl oxide","31242-93-0",null,0.5,null,null,null,null,null,3,3,"3","-","-","-",null,"Chloracne; liver damage",4]
[null,null,112,"Chlorine","7782-50-5",null,null,null,null,null,1,3,"1A","1A","1C","-","- ","Acute toxicity – category 3\nEye irritation – category 2\nSTOT (single exposure) – category 3\nSkin irritation – category 2","Possibly a Cat 2 given GHS STOT hazard category.  Should be a Cat 1A given it has only a peak value.","URT & eye irr","1B","M"]
[null,null,113,"Chlorine dioxide","10049-04-4",0.1,0.28000000000000003,null,0.3,0.83,null,null,2,2,"2","-","- ","Oxidising gas – category 1\nAcute toxicity – category 2\nSkin corrosion – category 1B",null,"LRT irr; bronchitis","1B"]
[null,null,114,"Chlorine trifluoride","7790-91-2",null,null,null,null,null,0.1,0.38,"1A","1A","1A","-","- ","- ",null,"Eye & URT irr; lung damage","1A"]
[null,null,115,"1-Chloro-1-nitropropane","600-25-9",2,10,null,null,null,null,null,2,2,"2","-","- ","Acute toxicity – category 4",null,"Eye irr; pulmonary oedema",4]
[null,null,116,"Chloroacetaldehyde","107-20-0",null,null,null,null,null,1,3.2,"1A","1A","1A","Carc. 2","-","Carcinogenicity – category 2\nAcute toxicity – category 2\nAcute toxicity – category 3\nSkin corrosion – category 1B","Should be changed to Cat 4 based on GHS chronic health and acute toxicity, but there is no TWA WES.  It is an irritant with only a peak / ceiling value, hence remains Cat 1A.","URT & eye irr (possible mutagen)","1A","M"]
[null,null,117,"Chloroacetone","78-95-5",null,null,null,null,null,1,3.8,"1A","1A","1A","-","Sk","-",null,"Eye & URT irr; skin notation","1A"]
[null,null,118,"alpha-Chloroacetophenone (Phenacyl chloride)","532-27-4",0.05,0.32,null,null,null,null,null,"1B","1B","1B","-","-","-",null,"Eye, URT & skin irr","1B"]
[null,null,119,"Chloroacetyl chloride (Chloroacetic acid chloride)","79-04-9",0.05,0.23,null,0.15,0.69,null,null,"1B",4,"1B","-","Sk","Acute toxicity – category 3\nSTOT (repeated exposure) – category 1\nSkin corrosion – category 1A","Has health effects after both short and long term exposure.  In addition, ACGIH and SWA has a STEL value.","URT irr; skin notation","1B","Y"]
[null,null,120,"Chlorobenzene","108-90-7",10,46,null,null,null,null,null,4,4,"4","-","-","Acute toxicity – category 4\nSkin irritation – category 2",null,"Liver damage",4]
[null,null,121,"o-Chlorobenzylidene malononitrile","2698-41-1",null,null,null,null,null,0.05,0.39,"1A","1A","1A","-","Sk","-",null,"URT irr; skin sens; skin notation","1A"]
[null,null,122,"Chlorobromomethane (Bromochloromethane)","74-97-5",200,1060,null,null,null,null,null,3,3,"3","-","-","-",null,"CNS impairment; liver damage",4]
[null,null,123,"Chlorodifluoromethane (Difluorochloromethane, Fluorocarbon 22, Freon 22)","75-45-6",1000,3540,null,null,null,null,null,"1C","1C","1C","-","-","-",null,"CNS impairment; asphyxia; cardiac sensitisation",4]
[null,null,124,"Chloroform (Trichloromethane)","67-66-3",2,10,null,null,null,null,null,4,4,"4","Carc. 2","Sk","Acute toxicity – category 4\nAcute toxicity – category 3\nCarcinogenicity – category 2\nEye irritation – category 2A\nSkin irritation – category 2\nSTOT (repeated exposure) – category 2",null,"Liver damage; embryo/foetal damage; CNS impairment",4]
[null,null,125,"bis(Chloromethyl) ether","542-88-1",1E-3,5.0000000000000001E-3,null,null,null,null,null,3,3,"3","Carc. 1A","-","Carcinogenicity – category 1A\nAcute toxicity – category 2\nAcute toxicity – category 3\nAcute toxicity – category 4 ",null,null,3]
[null,null,126,"Chloropentafluoroethane (Fluorocarbon 115, Freon 115)","76-15-3",1000,6320,null,null,null,null,null,"1C","1C","1C","-","-","-",null,"Cardiac sensitisation",4]
[null,null,127,"Chloropicrin (Trichloronitromethane)","76-06-2",0.1,0.67,null,null,null,null,null,2,2,"2","-","-","Acute toxicity – category 1\nAcute toxicity – category 4\nSTOT (repeated exposure) – category 1\nEye irritation – category 2\nSkin irritation – category 2\nSTOT (single exposure) – category 3",null,"Eye irr; pulmonary oedema","1B"]
[null,null,128,"beta-Chloroprene (2-Chloro-1,3-butadiene)","126-99-8",10,36,null,null,null,null,null,4,4,"4","Carc. 1B","Sk","Carcinogenicity – category 1B\nAcute toxicity – category 4\nEye irritation – category 2\nSTOT (single exposure) – category 3\nSkin irritation – category 2\nSTOT (repeated exposure) – category 2",null,null,4]
[null,null,129,"2-Chloropropionic acid","598-78-7",0.1,0.44,null,null,null,null,null,3,3,"3","-","Sk","Acute toxicity – category 4\nSkin corrosion – category 1A",null,"Male repro damage",4]
[null,null,130,"o-Chlorostyrene","2039-87-4",50,283,null,75,425,null,null,4,4,"4","-","-","-",null,null,4]
[null,null,131,"Chlorosulphonic acid","7790-94-5",0.20899999999999999,1,null,null,null,null,null,2,2,null,"-","-","Skin corrosion – category 1A\nSTOT (single exposure) – category 3",null,"(URT irr; corrosive to eyes, skin & mucous membranes (+ chronic effects?))"]
[null,null,132,"o-Chlorotoluene","95-49-8",50,259,null,null,null,null,null,"1B","1B","1B","-","-","Acute toxicity – category 4",null,null,"1B"]
[null,null,133,"Chlorpyrifos (Dursban)","2921-88-2",null,0.2,null,null,null,null,null,4,4,"4","-","Sk","Acute toxicity – category 3",null,"Cholinesterase inhib; skin notation",2]
[null,null,134,"Chromium (II) compounds (as Cr)",null,null,0.5,null,null,null,null,null,3,3,null,"-","-","-",null,"(NIOSH Pocket Guide - eye irr; sensitisation dermatitis)"]
[null,null,135,"Chromium (III) compounds (as Cr)",null,null,0.5,null,null,null,null,null,3,3,"3","-","-","-",null,"URT & skin irr",3]
[null,null,136,"Chromium (metal)","7440-47-3",null,0.5,null,null,null,null,null,3,3,"3","-","-","-",null,"URT & skin irr",3]
[null,null,137,"Chromium (VI) compounds (as Cr), certain water insoluble ",null,null,0.05,null,null,null,null,null,3,4,"3","Carc. 1A","Sen","Carcinogenicity – category 1A\nAcute toxicity – category 3\nAcute toxicity – category 1\nSkin corrosion – category 1\nSTOT (repeated exposure) – category 1\nRespiratory sensitisation – category 1\nSkin sensitisation – category 1","Has acute as well as long term health effects. \nPlasma clearance occurs over hours and for tissues several days (ATSDR) - implies it meets or at least approaches the acute criteria.","Lung cancer",3,"Y"]
[null,null,138,"Chromium (VI) compounds (as Cr), water soluble",null,null,0.05,null,null,null,null,null,3,3,"3","-","Sen ","Carcinogenicity – category 1B\nSkin sensitisation – category 1",null,"URT irr; cancer",3]
[null,null,139,"Clopidol (Coyden)","2971-90-6",null,10,null,null,null,null,null,"1C","1C","1C","-","- ","- ",null,"Mutagenic effect","1C"]
[null,null,140,"Coal dust (containing < 5% quartz) (respirable dust)",null,null,3,null,null,null,null,null,3,3,"3","-","- ","- ",null,"Lung damage; pulmonary fibrosis",3]
[null,null,141,"Coal tar pitch volatiles (as benzene solubles)","65996-93-2",null,0.2,null,null,null,null,null,3,3,"3","Carc. 1B","-","Carcinogenicity – category 1A\nGerm cell mutagenicity – category 1B\nReproductive toxicity – category 1B\nSkin sensitisation – category 1",null,"Cancer",3]
[null,null,142,"Cobalt carbonyl (as Co)","10210-68-1",null,0.1,null,null,null,null,null,2,2,"2","-","Sen","-",null,"Pulmonary oedema; spleen damage",4]
[null,null,143,"Cobalt hydrocarbonyl (as Co)","16842-03-8",null,0.1,null,null,null,null,null,2,2,"2","-","Sen","-",null,"Pulmonary oedema; lung damage",4]
[null,null,144,"Cobalt, metal dust & fume (as Co) ","7440-48-4",null,0.05,null,null,null,null,null,3,4,"3","-","Sen","Acute toxicity – category 4\nAcute toxicity – category 1\nCarcinogenicity – category 1B\nSTOT (single exposure) – category 3\nSTOT (repeated exposure) – category 2\nReproductive toxicity – category 1B\nRespiratory sensitisation – category 1\nSkin sensitisation – category 1","Has acute as well as long term-health effects.","Asthma; pulmonary function; myocardial effect",4,"Y"]
[null,null,145,"Copper (fume)","7440-50-8",null,0.2,null,null,null,null,null,2,2,"2","-","-","-",null,"Irr; GI; metal fume fever",4]
[null,null,146,"Copper, dusts & mists (as Cu)","7440-50-8",null,1,null,null,null,null,null,2,2,"1B","-","-","-",null,"Irr; GI; (metal fume fever)",4]
[null,null,147,"Cotton dust, raw ",null,null,0.2,null,null,null,null,null,3,3,"3","-","-","-",null,"Byccinosis; bronchitis; pulmonary function",4]
[null,null,148,"Cresol, all isomers","1319-77-3",5,22,null,null,null,null,null,"1B",2,"1B","-","Sk","Acute toxicity – category 3\nSkin corrosion – category 1A","Should be Cat 2 based on  GHS category 1 for skin.","URT irr",3,"Y"]
[null,null,149,"Cristobalite (respirable dust)","14464-46-1",null,0.1,null,null,null,null,null,3,3,"3","-","-","Carcinogenicity – category 1A\nSTOT (repeated exposure) – category 1",null,"Pulm fibrosis; lung cancer",3]
[null,null,150,"Crotonaldehyde (trans-But-2-enal)","4170-30-3",2,5.7,null,null,null,null,null,"1B",4,"1B",null,"-","Acute toxicity – category 1\nAcute toxicity – category 3\nSkin irritation – category 2\nEye damage – category 1\nGerm cell mutagenicity – category 1B\nSTOT (single exposure) – category 3\nSTOT (repeated exposure) – category 2","Has acute as well as long term-health effects. Consider 4 by analogy with formaldehyde.","Eye & URT irr (analagous to formaldahyde); skin notation","1A","Y"]
[null,null,151,"Crufomate","299-86-5",null,5,null,null,null,null,null,4,4,"4","-","-","Acute toxicity – category 4",null,null,4]
[null,null,152,"Cumene (Isopropyl benzene)","98-82-8",25,125,null,75,375,null,null,2,4,"2","-","Sk","Carcinogenicity – category 1B\nSTOT (single exposure) – category 3","Has acute as well as long term-health effects.","Eye, skin & URT irr; CNS impairment",2,"Y"]
[null,null,153,"Cyanamide","420-04-2",null,2,null,null,null,null,null,4,4,"1B","-","Sen","Acute toxicity – category 3\nAcute toxicity – category 4\nEye irritation – category 2\nSkin irritation – category 2\nSkin sensitisation – category 1",null,"Skin & eye irr",4]
[null,null,154,"Cyanides (as CN)","151-50-8",null,5,null,null,null,null,null,2,2,"1A","-","Sk","Acute toxicity – category 1\nAcute toxicity – category 2\nSkin irritation – category 2",null,"URT irr; headache; nausea; thyroid effects",4]
[null,null,155,"Cyanogen (Oxalonitrile)","460-19-5",10,21,null,null,null,null,null,"1B","1B","1B","-","- ","Acute toxicity – category 3",null,"Eye & URT irr; ceiling value assigned",4]
[null,null,156,"Cyanogen chloride","506-77-4",null,null,null,null,null,0.3,0.75,"1A","1A","1A","-","- ","- ",null,"Pulmonary oedema; URT, eye & skin irr; ceiling value assigned","1A"]
[null,null,157,"Cyclohexane","110-82-7",100,350,null,300,1050,null,null,2,2,"1B","-","- ","Skin irritation – category 2\nSTOT (single exposure) – category 3",null,"CNS impairment","1B"]
[null,null,158,"Cyclohexanol","108-93-0",50,206,null,null,null,null,null,4,4,"4","-","Sk","Acute toxicity – category 4\nSTOT (single exposure) – category 3\nSkin irritation – category 2 ",null,"Eye irr; CNS impairment",3]
[null,null,159,"Cyclohexanone (Anone)","108-94-1",25,100,null,null,null,null,null,3,3,"3","-","Sk","Acute toxicity – category 4",null,"Eye & URT irr",3]
[null,null,160,"Cyclohexene","110-83-8",300,1010,null,null,null,null,null,"1B","1B","1B","-","-","-",null,"URT & eye irr","1B"]
[null,null,161,"Cyclohexylamine (Aminocyclohexane)","108-91-8",10,41,null,null,null,null,null,"1B",2,"1B",null,"-","Acute toxicity – category 3\nAcute toxicity – category 4\nSkin corrosion – category 1B\nReproductive toxicity – category 2","Should be Cat 2 based on  GHS category 1 for skin.","URT & eye irr","1B","Y"]
[null,null,162,"Cyclonite (Hexahydro-1,3,5-trinitro-1,3,5-triazine, RDX)","121-82-4",null,1.5,null,null,null,null,null,3,3,"3","-","Sk","-",null,"Liver damage",4]
[null,null,163,"Cyclopentadiene","542-92-7",75,203,null,null,null,null,null,"1B","1B","1B","-","-","-",null,"URT & eye irr","1B"]
[null,null,164,"Cyclopentane","287-92-3",600,1720,null,null,null,null,null,4,4,"4","-","-","-",null,"URT, eye & skin irr; CNS impairment",2]
[null,null,165,"Cyhexatin (Tricyclohexyltin hydroxide, Plictran)","13121-70-5",null,5,null,null,null,null,null,"1C","1C","1C","-","-","Acute toxicity – category 4",null,"URT irr; body weight effect; kidney damage","1B"]
[null,null,166,"2,4-D (2,4-Dichlorophenoxyacetic acid)","94-75-7",null,10,null,null,null,null,null,3,3,"3","-","Sen","Acute toxicity – category 4\nSTOT (single exposure) – category 3\nEye damage – category 1\nSkin sensitisation – category 1",null,"Thyroid effect; kidney tubular damage","1C"]
[null,null,167,"DDT (Dichlorodiphenyl-trichloroethane)","50-29-3",null,1,null,null,null,null,null,4,4,"4","Carc. 2","-","Carcinogenicity – category 2\nAcute toxicity – category 3\nSTOT (repeated exposure) – category 1",null,"Liver damage",4]
[null,null,168,"Decaborane","17702-41-9",0.05,0.25,null,0.15,0.75,null,null,4,4,"4","-","Sk",null,null,"CNS convulsions; cognitive decrement",4]
[null,null,169,"Demeton (Systox)","8065-48-3",0.01,0.11,null,null,null,null,null,4,4,"4","-","Sk","Acute toxicity – category 1\nAcute toxicity – category 2",null,"Cholinesterase inhibition; skin notation",4]
[null,null,170,"Diacetone alcohol (4-Hydroxy-4-methyl-2-pentanone)","123-42-2",50,238,null,null,null,null,null,"1B","1B","1B","-","-","Eye irritation – category 2A",null,"URT & eye irr","1B"]
[null,null,171,"Diatomaceous earth (uncalcined) ","61790-53-2",null,10,null,null,null,null,null,"1C","1C","1C","-","-","-",null,null,3]
[null,null,172,"Diazinon","333-41-5",null,0.1,null,null,null,null,null,4,4,"4","-","Sk","Acute toxicity – category 4",null,null,4]
[null,null,173,"Diazomethane","334-88-3",0.2,0.34,null,null,null,null,null,4,4,"4","Carc. 1B","-","Carcinogenicity – category 1B",null,null,4]
[null,null,174,"Diborane","19287-45-7",0.1,0.11,null,null,null,null,null,4,4,"4","-","-","-",null,null,4]
[null,null,175,"Dibutyl phenyl phosphate","2528-36-1",0.3,3.5,null,null,null,null,null,4,4,"4","-","Sk","-",null,null,4]
[null,null,176,"Dibutyl phosphate (Dibutyl hydrogen phosphate)","107-66-4",1,8.6,null,2,17,null,null,"1B","1B","1B","-","- ","-",null,null,"1B"]
[null,null,177,"Dibutyl phthalate","84-74-2",null,5,null,null,null,null,null,4,4,"1B","Repr. 1B","-","Reproductive toxicity – category 1B",null,"Testicular damage; eye & URT irr",4]
[null,null,178,"2-N-Dibutylaminoethanol (N,N-Di-n-butylaminoethanol)","102-81-8",2,14,null,null,null,null,null,3,3,"3","-","Sk","-",null,null,3]
[null,null,179,"1,1-Dichloro-1-nitroethane","594-72-9",2,12,null,null,null,null,null,2,2,"2","-","-","Acute toxicity – category 3",null,"URT irr (bronchitis & pulmonary oedema secondarily protected)","1B"]
[null,null,180,"1,3-Dichloro-5,5-dimethyl hydantoin","118-52-5",null,0.2,null,null,0.4,null,null,"1B","1B","1B","-","-","-",null,"URT irr",4]
[null,null,181,"Dichloroacetylene","7572-29-4",null,null,null,null,null,0.1,0.39,"1A","1A","1A","Carc. 2","-","Carcinogenicity – category 2\nSTOT (repeated exposure) – category 2","Should be changed to Cat 4 based on GHS chronic health and acute toxicity, but there is no TWA WES.  It is an irritant with only a peak / ceiling value, hence remains Cat 1A.","Nausea; PNS impair (liver)","1A","M"]
[null,null,182,"o-Dichlorobenzene (1,2-dichlorobenzene)","95-50-1",25,150,null,50,301,null,null,"1B","1B","1A","-","-","Acute toxicity – category 4\nEye irritation – category 2\nSTOT (single exposure) – category 3\nSkin irritation – category 2","Possibly a Cat 2 given GHS STOT hazard category.","URT & eye irr; liver damage (in rats)",4,"M"]
[null,null,183,"p-Dichlorobenzene (1,4-dichlorobenzene)","106-46-7",25,150,null,50,300,null,null,3,3,"3","Carc. 2","-","Carcinogenicity – category 2\nEye irritation – category 2",null,"Eye irr; kidney damage",3]
[null,null,184,"Dichlorodifluoromethane (Fluorocarbon 12, Freon 12)","75-71-8",1000,4950,null,null,null,null,null,"1C","1C","1C","-","-","-",null,"Cardiac sensitisation",2]
[null,null,185,"1,1-Dichloroethane (Ethylidene chloride)","75-34-3",100,412,null,null,null,null,null,4,4,"4","-","Sk","Acute toxicity – category 4\nEye irritation – category 2A\nSTOT (single exposure) – category 3",null,null,4]
[null,null,186,"Dichloroethyl ether (bis-(2-Chloroethyl)-ether)","111-44-4",5,29,null,10,58,null,null,2,4,"2","Carc. 2","Sk","Acute toxicity – category 1\nCarcinogenicity – category 2","Has health effects after both short and long term exposure.","URT & eye irr; nausea","1A","Y"]
[null,null,187,"1,2-Dichloroethylene (Acetylene dichloride)","540-59-0",200,793,null,null,null,null,null,4,4,"4","-","-","Acute toxicity – category 4",null,null,4]
[null,null,188,"Dichlorofluoromethane (Fluorocarbon 21, Freon 21)","75-43-4",10,42,null,null,null,null,null,3,3,"4","-","-","-",null,"Liver damage",3]
[null,null,189,"Dichloropropene (gamma-Chloroallyl chloride, 1,3-dichloropropene)","542-75-6",1,4.5,null,null,null,null,null,4,4,"4",null,"Sk:Sen","Acute toxicity – category 3\nAcute toxicity – category 4\nEye irritation – category 2\nSTOT (single exposure) – category 3\nSkin irritation – category 2\nSkin sensitisation – category 1 E",null,"Kidney damage","1B"]
[null,null,190,"2,2-Dichloropropionic acid (Dalapon)","75-99-0",1,5.8,null,null,null,null,null,"1B","1B","1B","-","-","Skin irritation – category 2\nEye damage – category 1","Could be changed to Cat 2 based on GHS for acute eye damage.  Possibly should have a peak / ceiling value.","Eye & URT irr","1B","M"]
[null,null,191,"Dichlorotetrafluoroethane (Fluorocarbon 114, Freon 114, R-114, Tetrafluoro dichloroethane)","76-14-2",1000,6990,null,null,null,null,null,"1C","1C",null,"-","-","-",null,"Pulmonary function","1C"]
[null,null,192,"Dichlorvos (DDVP)","62-73-7",0.1,0.9,null,null,null,null,null,4,4,"4","-","Sk:Sen","Acute toxicity – category 2\nAcute toxicity – category 3\nSkin sensitisation – category 1",null,"Cholinesterase inhib; skin notation & sensitiser",4]
[null,null,193,"Dicrotophos (Bidrin)","141-66-2",null,0.25,null,null,null,null,null,4,4,"4","-","Sk","Acute toxicity – category 2\nAcute toxicity – category 3",null,"Cholinesterase inhib; skin notation",2]
[null,null,194,"Dicyclopentadiene (3a,4,7,7a-tetrahydro-4,7-methanoindene)","77-73-6",5,27,null,null,null,null,null,3,3,"3","-","-","Acute toxicity – category 4\nEye irritation – category 2\nSkin irritation – category 2\nSTOT (single exposure) – category 3 ",null,"URT, LRT & eye irr",3]
[null,null,195,"Dicyclopentadienyl iron (Ferrocene)","102-54-5",null,10,null,null,null,null,null,"1C","1C","1C","-","-","-",null,"Liver damage","1C"]
[null,null,196,"Dieldrin","60-57-1",null,0.25,null,null,null,null,null,4,4,"4","Carc. 2","Sk","Carcinogenicity – category 2\nAcute toxicity – category 1\nAcute toxicity – category 3\nSTOT (repeated exposure) – category 1",null,"Liver damage; repro effect; CNS impairment",4]
[null,null,197,"Diethanolamine (2,2'-Iminodiethanol)","111-42-2",3,13,null,null,null,null,null,4,4,"1B","-","- ","Acute toxicity – category 4\nEye damage – category 1\nSkin irritation – category 2\nSTOT (single exposure) – category 3\nSTOT (repeated exposure) – category 2",null,"Liver & kidney damage (also irritative effects)",4]
[null,null,198,"Diethyl ketone (3-Pentanone)","96-22-0",200,705,null,null,null,null,null,2,2,"2","-","- ","STOT (single exposure) – category 3",null,null,2]
[null,null,199,"Diethyl phthalate","84-66-2",null,5,null,null,null,null,null,"1B","1B","3","-","- ","-",null,"URT irr","1B"]
[null,null,200,"Diethylamine ","109-89-7",10,30,null,25,75,null,null,"1B","1B","1B","-","- ","Acute toxicity – category 4\nSkin corrosion – category 1A",null,"URT & eye irr; skin notation","1B"]
[null,null,201,"2-Diethylaminoethanol ","100-37-8",10,48,null,null,null,null,null,"1B",2,"1B","-","Sk ","Acute toxicity – category 3\nAcute toxicity – category 4\nSkin corrosion – category 1","Is an irritant, but does have acute (CNS) effects (ACGIH).","URT irr; CNS convulsions; skin notation",3,"Y"]
[null,null,202,"Diethylene triamine (2,2'-Diaminodiethylamine, 1,4,7-Tri-(aza)-heptane)","111-40-0",1,4.2,null,null,null,null,null,4,4,"3","-","Sk:Sen","Acute toxicity – category 4\nAcute toxicity – category 2\nSkin corrosion – category 1A\nSkin sensitisation – category 1",null,"URT & eye irr; skin notation","1B"]
[null,null,203,"Difluorodibromomethane (Dibromodifluoromethane)","75-61-6",100,858,null,null,null,null,null,4,4,"4","-","-","-",null,null,4]
[null,null,204,"Diglycidyl ether (DGE, bis(2,3-Epoxy propyl) ether)","2238-07-5",0.1,0.53,null,null,null,null,null,3,3,"3","-","-","-",null,"Eye & skin irr; male repro damage",4]
[null,null,205,"Diisobutyl ketone (2,6-Dimethyl-4-heptanone)","108-83-8",25,145,null,null,null,null,null,"1B","1B","1B","-","-","STOT (single exposure) – category 3",null,null,"1B"]
[null,null,206,"Diisopropylamine","108-18-9",5,21,null,null,null,null,null,"1B",2,"1B","-","Sk","Acute toxicity – category 4\nSkin corrosion – category 1B","Should be Cat 2 based on  GHS category 1 for skin.",null,"1B","Y"]
[null,null,207,"Dimethyl acetamide","127-19-5",10,36,null,null,null,null,null,4,4,"4","-","Sk","Acute toxicity – category 4\nSTOT (repeated exposure) – category 2\nReproductive toxicity – category 1B",null,null,4]
[null,null,208,"Dimethyl ether","115-10-6",400,760,null,500,950,null,null,"1B","1B",null,"-","-",null,null,"(SCOEL documentation - low toxicity; CNS effects at high concentrations)"]
[null,null,209,"Dimethyl sulphate","77-78-1",0.1,0.52,null,null,null,null,null,4,4,"3","Carc. 1B","Sk:Sen","Carcinogenicity – category 1B\nGerm cell mutagenicity – category 2\nAcute toxicity – category 1\nAcute toxicity – category 3\nSkin sensitisation – category 1\nSkin corrosion – category 1B",null,"Eye & skin irr; skin notation","1B"]
[null,null,210,"Dimethylamine","124-40-3",2,3.8,null,6,11,null,null,"1B",2,"1B","-","-","Acute toxicity – category 4\nSTOT (single exposure) – category 3\nSkin irritation – category 2\nEye damage – category 1","Should be Cat 2 as it has GHS category 1 for eye and 2 for skin, plus acute toxicity, although Cat 4 - harmful only.","URT & GI irr","1B","Y"]
[null,null,211,"Dimethylaminoethanol","108-01-0",2,7.4,null,6,22,null,null,"1B",2,null,"-","-","Acute toxicity – category 4\nSkin sensitisation – category 1\nSkin corrosion – category 1","Should be Cat 2 as it has GHS category 1 for skin and acute toxicity, although is Cat 4 - harmful only.","(UK HSE documentation - Eye & URT irr)",null,"Y"]
[null,null,212,"N,N-Dimethylaniline","121-69-7",5,25,null,10,50,null,null,4,4,"4","Carc. 2","Sk","Acute toxicity – category 3\nCarcinogenicity – category 2\nSTOT (repeated exposure) – category 2",null,null,4]
[null,null,213,"N,N-Dimethylethylamine (ethyldimethylamine)","598-56-1",10,30,null,15,45,null,null,4,4,null,"-","-","Acute toxicity – category 4\nSkin corrosion – category 1B",null,"(UK HSE documentation - reversible visual disturbance / visual impairment; URT irr)"]
[null,null,214,"Dimethylformamide","68-12-2",10,30,null,null,null,null,null,3,3,"3",null,"Sk","Reproductive toxicity – category 1B\nAcute toxicity – category 4\nEye irritation – category 2A",null,null,3]
[null,null,215,"1,1-Dimethylhydrazine","57-14-7",0.01,2.5000000000000001E-2,null,null,null,null,null,3,3,"3","Carc. 1B","Sk","Acute toxicity – category 3\nAcute toxicity – category 4\nAcute toxicity – category 2\nCarcinogenicity – category 1B\nGerm cell mutagenicity – category 2\nSkin corrosion – category 1B",null,null,3]
[null,null,216,"Dimethylphthalate","131-11-3",null,5,null,null,null,null,null,"1B","1B","1B","-","-","-",null,"Eye & URT irr","1C"]
[null,null,217,"Dinitolmide (3,5-Dinitro-o-toluamide, Zoalene)","148-01-6",null,5,null,null,null,null,null,3,3,"3","-","-","-",null,null,3]
[null,null,218,"m-Dinitrobenzene (1,3-dinitrobenzene)","99-65-0",0.15,1,null,null,null,null,null,4,4,"4","-","Sk","Acute toxicity – category 1\nAcute toxicity – category 2\nSTOT (repeated exposure) – category 2",null,"MeHb-emia; eye damage; skin notation",4]
[null,null,219,"o-Dinitrobenzene (1,2-dinitrobenzene)","528-29-0",0.15,1,null,null,null,null,null,4,4,4,"-","Sk","Acute toxicity – category 1\nAcute toxicity – category 2\nSTOT (repeated exposure) – category 2",null,"MeHb-emia; eye damage; skin notation",4]
[null,null,220,"p-Dinitrobenzene (1,4-dinitrobenzene)","100-25-4",0.15,1,null,null,null,null,null,4,4,"4","-","Sk","Acute toxicity – category 1\nAcute toxicity – category 2\nSTOT (repeated exposure) – category 2",null,"MeHb-emia; eye damage; skin notation",4]
[null,null,221,"Dinitro-o-cresol (DNOC, 2-Methyl-4,6-dinitrophenol)","534-52-1",null,0.2,null,null,null,null,null,3,3,"3",null,"Sk:Sen","Germ cell mutagenicity – category 2\nAcute toxicity – category 1\nAcute toxicity – category 2\nEye damage – category 1\nSkin sensitisation – category 1\nSkin irritation – category 2",null,null,3]
[null,null,222,"Dinitrotoluene ","25321-14-6",null,1.5,null,null,null,null,null,4,4,"4","Carc. 1B","Sk","STOT (single exposure) – category 1\nCarcinogenicity – category 1B\nGerm cell mutagenicity – category 2\nSTOT (repeated exposure) – category 2\nReproductive toxicity – category 2",null,null,4]
[null,null,223,"1,4-Dioxane (Diethylene dioxide)","123-91-1",10,36,null,null,null,null,null,3,3,"3","Carc. 2","Sk","Carcinogenicity – category 2\nEye irritation – category 2\nSTOT (single exposure) – category 3",null,"Liver damage",4]
[null,null,224,"Dioxathion (Delnav)","78-34-2",null,0.2,null,null,null,null,null,4,4,"3","-","Sk","Acute toxicity – category 2\nAcute toxicity – category 3",null,"Cholinesterase inhib; skin notation",4]
[null,null,225,"Diphenylamine","122-39-4",null,10,null,null,null,null,null,4,4,"4","-","-","Acute toxicity – category 3\nSTOT (repeated exposure) – category 2",null,null,4]
[null,null,226,"Dipropyl ketone (4-Heptanone)","123-19-3",50,233,null,null,null,null,null,"1B","1B",null,"-","-","Acute toxicity – category 4",null,"URT irr (ACGIH 2011 documentation - Eye, skin & URT irr; narcosis; marginal liver effects at > 1000 ppm)",4]
[null,null,227,"Diquat (Diquat dibromide (ISO))","85-00-7",null,0.5,null,null,null,null,null,3,3,"3","-","Sen","Acute toxicity – category 2\nSTOT (repeated exposure) – category 1\nAcute toxicity – category 4\nEye irritation – category 2\nSkin irritation – category 2\nSkin sensitisation – category 1\nSTOT (single exposure) – category 3",null,null,3]
[null,null,228,"Di-sec-octyl phthalate (DOP, Di (2-ethylhexyl) phthalate, bis(2-Ethylhexyl) phthalate)","117-81-7",null,5,null,null,10,null,null,3,3,"3","-","- ","Carcinogenicity – category 1B\nReproductive toxicity – category 1B",null,"(NIOSH Int Chem Safety Cards - eye & URT irr; male repro effects)","1B"]
[null,null,229,"Disulfiram (Tetraethyl thiuram disulphide)","97-77-8",null,2,null,null,null,null,null,2,4,"2","-","Sen","Acute toxicity – category 4\nSkin sensitisation – category 1\nGerm cell mutagenicity – category 2\nSTOT (repeated exposure) – category 2","Has health effects after both short and long term exposure.","Vasodilation; nausea",4,"Y"]
[null,null,230,"Disulfoton (Disyston)","298-04-4",null,0.1,null,null,null,null,null,4,4,"4","-","-","Acute toxicity – category 1\nAcute toxicity – category 2",null,"Cholinesterase inhibitor; skin notation",4]
[null,null,231,"2,6-Di-tert-butyl-p-cresol","128-37-0",null,10,null,null,null,null,null,"1C","1C","1C","-","-","-",null,null,"1B"]
[null,null,232,"Diuron","330-54-1",null,10,null,null,null,null,null,"1C",4,"1C","Carc. 2","-","Carcinogenicity – category 2\nAcute toxicity – category 4\nSTOT (repeated exposure) – category 2","Has health effects after both short and long term exposure.","URT irr","1C","Y"]
[null,null,233,"Divinyl benzene","1321-74-0",10,53,null,null,null,null,null,"1B","1B","1B","-","-","-",null,null,"1B"]
[null,null,234,"Emery (dust) ","1302-74-5",null,10,null,null,null,null,null,"1C","1C","1C","-","-","-",null,null,"1C"]
[null,null,235,"Endosulfan (Thiodan)","115-29-7",null,0.1,null,null,null,null,null,4,2,"4","-","Sk","Acute toxicity – category 2\nAcute toxicity – category 4","Should be Cat 2 as it appears to have only acute toxicity.","LRT irr; liver & kidney damage; skin notation",4,"Y"]
[null,null,236,"Endrin","72-20-8",null,0.1,null,null,null,null,null,2,2,"2","-","Sk","Acute toxicity – category 2\nAcute toxicity – category 3","Effects are acute only.","Liver damage; CNS impairment; headache; skin notation",4]
[null,null,237,"Enflurane (2-Chloro-1,1,2-trifluoroethyl difluoromethyl ether)","13838-16-9",0.5,3.8,null,null,null,null,null,2,2,"2","-","-","-",null,"CNS impairment; cardiac impairment",4]
[null,null,238,"Epichlorohydrin (1-Chloro-2,3-epoxy-propane; Oxirane, (chloromethyl)-)","106-89-8",2,7.6,null,null,null,null,null,4,4,"4","Carc. 1B","Sk:Sen","Acute toxicity – category 3\nGerm cell mutagenicity – category 1B\nSTOT (single exposure) – category 3\nSkin corrosion – category 1\nSkin sensitisation – category 1\nCarcinogenicity – category 1B\nReproductive toxicity – category 2",null,null,4]
[null,null,239,"EPN (O-Ethyl-O-(4-nitrophenyl) phenylthiophosphonate)","2104-64-5",null,0.5,null,null,null,null,null,4,4,"4","-","Sk","Acute toxicity – category 1\nAcute toxicity – category 2","Could move to 2 as it appears to have only acute toxicity.","Cholinesterase inhibition; skin notation",4,"M"]
[null,null,240,"Ethanolamine (2-Aminoethanol)","141-43-5",3,7.5,null,6,15,null,null,3,3,"3","-","-","Acute toxicity – category 4\nSkin corrosion – category 1B","Could move to 2 as it appears to have only acute toxicity.","Eye & skin irr",3,"M"]
[null,null,241,"Ethion (Nialate)","563-12-2",null,0.4,null,null,null,null,null,4,4,"4","-","Sk","Acute toxicity – category 3\nAcute toxicity – category 4","Could move to 2 as it appears to have only acute toxicity.","Cholinesterase inhibition; skin notation",4,"M"]
[null,null,242,"2-Ethoxyethanol (Cellosolve; Ethyl glycol; Ethylene glycol, monoethyl ether; Glycol, monoethyl ether)","110-80-5",5,18,null,null,null,null,null,4,4,"4","-","Sk","Reproductive toxicity – category 1B\nAcute toxicity (inhalation) - category 4\nAcute toxicity (ingestion) - category 4",null,"Male repro damage; embryo/foetal damage",4]
[null,null,243,"2-Ethoxyethyl acetate (Cellosolve acetate; Glycol, monoethyl ether acetate; Ethylene glycol, monoethyl ether acetate; Ethyl glycol acetate)","111-15-9",5,27,null,null,null,null,null,4,4,"4","-","Sk","Reproductive toxicity – category 1B\nAcute toxicity (inhalation) - category 4\nAcute toxicity (ingestion) - category 4",null,null,4]
[null,null,244,"Ethyl acetate (Acetic acid ethyl ester, Acetic ester)","141-78-6",200,720,null,400,1440,null,null,"1B","1B","1B","-","-","STOT (single exposure) – category 3\nEye irritation – category 2A","Could move to 2 as it has acute toxicity, however acute toxicity is mild and is of low toxicity, and it is more of an irritant.","URT & eye irr","1B"]
[null,null,245,"Ethyl acrylate (Acrylic acid,ethyl ester)","140-88-5",null,null,null,null,null,5,20,4,4,"3","-","Sen","Acute toxicity – category 4\nAcute toxicity – category 3\nEye irritation – category 2A\nSkin irritation – category 2\nSTOT (single exposure) – category 3\nSkin sensitisation – category 1","Should be Cat 4 based on GHS chronic health and acute toxicity, but there is no TWA WES.  It is an irritant with only a peak / ceiling value, hence could be classified as Cat 1A.  However, ACGIH have a TWA TLV.","URT, eye & GI irr; CNS impair; skin sens",4,"M"]
[null,null,246,"Ethyl alcohol (Ethanol)","64-17-5",1000,1880,null,null,null,null,null,"1B","1B","1B","-","- ","Eye irritation – category 2A",null,null,"1B"]
[null,null,247,"Ethyl benzene","100-41-4",100,434,null,125,543,null,null,4,4,"3","-","- ","Acute toxicity – category 4\nEye irritation – category 2A\nSkin irritation – category 2","Cat 4 looks appropriate based on ACGIH doco that does indicate potential chronic effects (CNS, liver, kidneys) - although its animal studies. But is an irritant","URT irr; kidney damage (nephropathy); cochlear impair",4]
[null,null,248,"Ethyl bromide (Bromoethane)","74-96-4",5,22,null,null,null,null,null,4,4,"4","Carc. 2","Sk","Acute toxicity – category 4\nCarcinogenicity – category 2",null,"Liver damage; CNS impairment",3]
[null,null,249,"Ethyl butyl ketone (3-Heptanone)","106-35-4",50,234,null,null,null,null,null,2,2,"2","-","-","Acute toxicity – category 4\nEye irritation – category 2",null,null,2]
[null,null,250,"Ethyl chloride (Chloroethane)","75-00-3",1000,2640,null,null,null,null,null,4,4,"4","Carc. 2","-","Carcinogenicity – category 2",null,null,3]
[null,null,251,"Ethyl ether (Diethyl ether)","60-29-7",400,1210,null,500,1520,null,null,"1B","1B","1B","-","-","Acute toxicity – category 4\nSTOT (single exposure) – category 3",null,"CNS impairment; URT irr",2]
[null,null,252,"Ethyl formate (Formic acid, ethyl ester)","109-94-4",100,303,null,null,null,null,null,"1B","1B","1B","-","-","Acute toxicity – category 4\nEye irritation – category 2\nSTOT (single exposure) – category 3",null,null,"1B"]
[null,null,253,"Ethyl mercaptan (Ethanethiol)","75-08-1",0.5,1.3,null,null,null,null,null,"1B","1B","1B","-","-","Acute toxicity – category 4",null,null,"1B"]
[null,null,254,"Ethyl silicate (Tetraethyl orthosilicate)","78-10-4",10,85,null,null,null,null,null,3,3,"3","-","-","Acute toxicity – category 4\nEye irritation – category 2\nSTOT (single exposure) – category 3",null,null,3]
[null,null,255,"Ethylamine","75-04-7",2,3.8,null,6,11,null,null,"1B","1B","1B","-","-","Eye irritation – category 2\nSTOT (single exposure) – category 3","Possibly a Cat 2 given GHS STOT hazard category, but it is more of an irritant.","URT irr","1B"]
[null,null,256,"Ethylene chlorohydrin (2-Chloroethanol)","107-07-3",null,null,null,null,null,1,3.3,"1A","1A","1A","-","Sk","Acute toxicity – category 1\nAcute toxicity – category 2",null,"CNS impairment; liver & kidney damage","1A"]
[null,null,257,"Ethylene dichloride (1,2-Dichloroethane)","107-06-2",10,40,null,null,null,null,null,3,4,"3","Carc. 1B","-","Acute toxicity – category 4\nAcute toxicity – category 3\nCarcinogenicity – category 1B\nEye irritation – category 2A\nSkin irritation – category 2\nSTOT (single exposure) – category 3\nGerm cell mutagenicity – category 2","Should be Cat 4 based on acute and chronic effects","Liver damage; nausea",4,"Y"]
[null,null,258,"Ethylene glycol (particulate) (Ethane-1,2-diol)","107-21-1",null,10,null,null,null,null,null,"1B",2,"1A","-","Sk","Acute toxicity – category 4\nSTOT (single exposure) – category 3","Should be Cat 2 given GHS STOT hazard category.","URT & eye irr","1A","Y"]
[null,null,259,"Ethylene glycol (vapour) (Ethane-1,2-diol)","107-21-1",20,52,null,40,104,null,null,"1B",2,"1A","-","Sk","Acute toxicity – category 4\nSTOT (single exposure) – category 3","Could be 1A based on ACGIH assigning peak, but also could argue Cat 2 as ingestion can cause acute effects (ACGIH)","URT & eye irr (headaches, vasodilation?)","1A","Y"]
[null,null,260,"Ethylene glycol dinitrate (EGDN, Ethylene dinitrate, Glycol dinitrate, Nitroglycol)","628-96-6",0.05,0.31,null,null,null,null,null,2,4,"1A","-","Sk","Acute toxicity – category 1\nAcute toxicity – category 2\nSTOT (repeated exposure) – category 2","Is a Cat 4 given GHS STOT hazard categories.  Also, ACGIH TLV is based on analogy with propylene glycol dinitrate, which is Cat 4.","Vasodilation; headache; skin notation",4,"Y"]
[null,null,261,"Ethylene oxide (Oxirane)","75-21-8",1,1.8,null,null,null,null,null,3,3,"3","Carc. 1B","-","Acute toxicity – category 4\nAcute toxicity – category 3\nCarcinogenicity – category 1B\nGerm cell mutagenicity – category 1B\nSkin corrosion – category 1B\nSTOT (repeated exposure) – category 1\nSkin sensitisation – category 1",null,"Cancer; CNS impairment",4]
[null,null,262,"Ethylenediamine (1,2-Diaminoethane)","107-15-3",10,25,null,null,null,null,null,3,3,"3","-","Sen","Acute toxicity – category 4\nSkin corrosion – category 1B\nSkin sensitisation – category 1\nRespiratory sensitisation – category 1",null,null,3]
[null,null,263,"Ethylenimine (Aziridine)","151-56-4",0.5,0.88,null,null,null,null,null,4,4,null,"Carc. 1B","Sk","Acute toxicity – category 2\nAcute toxicity – category 1\nCarcinogenicity – category 1B\nGerm cell mutagenicity – category 1B\nSkin corrosion – category 1C",null,null,4]
[null,null,264,"Ethylidene norbornene","16219-75-3",null,null,null,null,null,5,25,"1A","1A","1A","-","-","-",null,"URT & eye irr","1A"]
[null,null,265,"N-Ethylmorpholine","100-74-3",5,24,null,null,null,null,null,2,2,"2","-","Sk","-",null,"URT irr; eye damage","1B"]
[null,null,266,"Fenamiphos (Nemacur)","22224-92-6",null,0.1,null,null,null,null,null,4,4,"4","-","Sk","Acute toxicity – category 2\nEye irritation – category 2",null,null,4]
[null,null,267,"Fensulfothion (Dasanit)","115-90-2",null,0.1,null,null,null,null,null,4,4,"4","-","-","Acute toxicity – category 1\nAcute toxicity – category 2",null,null,4]
[null,null,268,"Fenthion (Baytex, Lebaycid)","55-38-9",null,0.2,null,null,null,null,null,4,4,"4","-","Sk","Germ cell mutagenicity – category 2\nAcute toxicity – category 3\nAcute toxicity – category 4\nSTOT (repeated exposure) – category 1",null,null,4]
[null,null,269,"Ferbam","14484-64-1",null,10,null,null,null,null,null,3,3,"1B","-","-","Eye irritation – category 2\nSTOT (single exposure) – category 3\nSkin irritation – category 2",null,"CNS impairment; body weight effect; spleen damage","1C"]
[null,null,270,"Ferrovanadium dust","12604-58-9",null,1,null,null,3,null,null,"1B","1B","1B","-","-","-",null,"Eye, URT & LRT irr",3]
[null,null,271,"Fluorides (as F)",null,null,2.5,null,null,null,null,null,3,3,"3","-","-","-",null,"Bone damage; fluorosis",4]
[null,null,272,"Fluorine","7782-41-4",1,1.6,null,2,3.1,null,null,"1B","1B","1B","-","-","Oxidising gas – category 1\nAcute toxicity – category 2\nSkin corrosion – category 1A",null,"URT, eye & skin irr","1B"]
[null,null,273,"Fonofos (Dyfonate)","944-22-9",null,0.1,null,null,null,null,null,4,4,"4","-","Sk","Acute toxicity – category 1\nAcute toxicity – category 2",null,null,4]
[null,null,274,"Formaldehyde ","50-00-0",1,1.2,null,2,2.5,null,null,4,4,"1A","Carc. 2","Sen","Acute toxicity (inhalation) - category 2\nAcute toxicity (ingestion) - category 3\nAcute toxicity (dermal) - category 3\nSkin corrosion – category 1\nSkin sensitisation – category 1\nCarcinogenicity – category 1B",null,"URT & eye irr, but an A2 carcinogen & sensitiser",4]
[null,null,275,"Formamide","75-12-7",10,18,null,null,null,null,null,3,3,"3","-","Sk ","Reproductive toxicity – category 1B\nSTOT (repeated exposure) – category 2",null,null,3]
[null,null,276,"Formic acid","64-18-6",5,9.4,null,10,19,null,null,"1B",2,"1B","-","- ","Acute toxicity – category 4\nAcute toxicity – category 3\nSTOT (single exposure) – category 3\nSkin corrosion – category 1","Is an irritant but also has acute effects (organ damage H331)","URT, skin & eye irr","1B","Y"]
[null,null,277,"Fumed silica (respirable dust)","69012-64-2",null,2,null,null,null,null,null,3,3,3,"-","- ","Carcinogenicity – category 1A\nSTOT (repeated exposure) – category 1"]
[null,null,278,"Furfural (2-Furaldehyde; 2-Furancarboxaldehyde)","98-01-1",2,7.9,null,null,null,null,null,"1B",4,"1B","-","Sk ","Acute toxicity – category 3\nCarcinogenicity – category 2\nSkin irritation – category 2\nSTOT (single exposure) – category 3\nEye irritation – category 2A","Is an irritant, but also has acute and long-term effects (see H classifications).","URT & eye irr","1B","Y"]
[null,null,279,"Furfuryl alcohol","98-00-0",10,40,null,15,60,null,null,"1B",4,"1B","Carc. 2","Sk ","Acute toxicity – category 3\nAcute toxicity – category 4\nEye irritation – category 2A\nSkin sensitisation – category 1\nCarcinogenicity – category 2\nSTOT (single exposure) – category 3\nSTOT (repeated exposure) – category 2","Is an irritant, but also has acute and long-term effects (see H classifications).","URT & eye irr","1B","Y"]
[null,null,280,"Germanium tetrahydride (Germane)","7782-65-2",0.2,0.63,null,null,null,null,null,2,2,"2","-","- ","-",null,"Haematologic effect",4]
[null,null,281,"Glutaraldehyde (1,5-Pentanedial)","111-30-8",null,null,null,null,null,0.1,0.41,4,"1A","1A","-","Sen ","Acute toxicity – category 2\nAcute toxicity – category 3\nSTOT (single exposure) – category 3\nSkin corrosion – category 1B\nRespiratory sensitisation – category 1\nSkin sensitisation – category 1A","Should be Cat 4 based on GHS chronic health and acute toxicity, but there is no TWA WES.  It is an irritant with only a peak / ceiling value, hence must be classified as Cat 1A.","URT, skin & eye irr; CNS impair; sensitiser","1A","Y"]
[null,null,282,"Glycerin mist ","56-81-5",null,10,null,null,null,null,null,"1C","1C","1C","-","- ","-",null,null,"1C"]
[null,null,283,"Glycidol (2,3-Epoxy-1-propanol)","556-52-5",25,76,null,null,null,null,null,4,4,"1B","Carc. 1B","-","Acute toxicity – category 4\nAcute toxicity – category 2\nCarcinogenicity – category 1B\nGerm cell mutagenicity – category 1B\nEye irritation – category 2A\nSkin irritation – category 2\nSTOT (single exposure) – category 3\nReproductive toxicity – category 1B",null,"URT, eye & skin irr; cancer & genotoxicity",3]
[null,null,284,"Grain dust (oats,wheat, barley)",null,null,4,null,null,null,null,null,4,4,"4","-","-","-",null,"Bronchitis; URT irr; pulmonary function",4]
[null,null,285,"Graphite (all forms except fibres) (respirable dust) (natural & synthetic)","7782-42-5",null,3,null,null,null,null,null,3,3,"3","-","-","-",null,"Pneumoconiosis",3]
[null,null,286,"Hafnium","7440-58-6",null,0.5,null,null,null,null,null,3,3,"3","-","-","-",null,"URT & eye irr; liver damage",3]
[null,null,287,"Halothane (1,1,1-Trifluoro-2-chloro-2-bromoethane)","151-67-7",0.5,4.0999999999999996,null,null,null,null,null,4,4,"4","-","-","-",null,"Liver damage; CNS impairment; vasodilation",4]
[null,null,288,"Heptachlor ","76-44-8",null,0.5,null,null,null,null,null,4,4,"4","Carc. 2","Sk","Carcinogenicity – category 2\nAcute toxicity – category 3\nSTOT (repeated exposure) – category 2",null,"Liver damage",4]
[null,null,289,"Heptane (n-Heptane)","142-82-5",400,1640,null,500,2050,null,null,2,2,"2","-","-","Skin irritation – category 2\nSTOT (single exposure) – category 3",null,"CNS impairment; URT irr",2]
[null,null,290,"Hexachlorobutadiene","87-68-3",0.02,0.21,null,null,null,null,null,3,3,"3","-","Sk","-",null,"Kidney damage",3]
[null,null,291,"Hexachlorocyclopentadiene","77-47-4",0.01,0.11,null,null,null,null,null,4,4,"4","-","-","Acute toxicity – category 2\nAcute toxicity – category 3\nAcute toxicity – category 4\nSkin corrosion – category 1B","Should be Cat 4 given ACGIH documentation.  GHS hazard category does not indicate any long-term effects!","URT irr + possible kidney & liver injury (animal studies)",4,"M"]
[null,null,292,"Hexachloroethane","67-72-1",1,9.6999999999999993,null,null,null,null,null,3,3,"3","-","-","Carcinogenicity – category 2\nEye irritation – category 2A\nSTOT (repeated exposure) – category 2",null,"Liver & kidney damage; skin notation",3]
[null,null,293,"Hexachloronaphthalene","1335-87-1",null,0.2,null,null,null,null,null,3,3,"3","-","Sk","-",null,"Liver damage; chlorachne; skin notation",3]
[null,null,294,"Hexafluoroacetone","684-16-2",0.1,0.68,null,null,null,null,null,4,4,"4","-","Sk","-",null,"Testicular & kidney damage; skin notation",4]
[null,null,295,"Hexamethylene diisocyanate (HDI)","822-06-0",null,0.02,null,null,7.0000000000000007E-2,null,null,3,4,"3","-","Sen","Acute toxicity – category 3\nEye irritation – category 2\nSTOT (single exposure) – category 3\nSkin irritation – category 2\nSkin sensitisation – category 1\nRespiratory sensitisation – category 1","Is an irritant, but also has acute and long-term effects (see H classifications).","URT irr; respiratory sensitiser",4,"Y"]
[null,null,296,"Hexane (n-Hexane)","110-54-3",20,72,null,null,null,null,null,4,4,"4","-","- ","Skin irritation – category 2\nReproductive toxicity – category 2\nSTOT (single exposure) – category 3\nSTOT (repeated exposure) – category 2",null,"CNS impairment; peripheral neuropothy; eye irr",3]
[null,null,297,"Hexane, other isomers",null,500,1760,null,1000,3500,null,null,"1C","1C","1C","-","- ","-",null,"CNS impairment; URT & eye irr",2]
[null,null,298,"sec-Hexyl acetate (1,3-Dimethyl butyl acetate)","108-84-9",50,295,null,null,null,null,null,"1B","1B","1B","-","- ","-",null,null,"1B"]
[null,null,299,"Hexylene glycol (2-Methylpentane-2,4-diol)","107-41-5",null,null,null,null,null,25,121,"1A","1A","1A","-","- ","Eye irritation – category 2\nSkin irritation – category 2",null,"Eye & URT irr","1A"]
[null,null,300,"Hydrazine (Diamine)","302-01-2",0.01,1.2999999999999999E-2,null,null,null,null,null,3,4,"3","-","Sk;Sen","Acute toxicity – category 3\nGerm cell mutagenicity – category 2\nSkin corrosion – category 1\nSTOT (repeated exposure) – category 1\nSkin sensitisation – category 1\nCarcinogenicity – category 1B","Cat 4 based on acute (H301, 311, 331) as well as chronic (cancer) effects.","URT irr; cancer",4,"Y"]
[null,null,301,"Hydrogen bromide","10035-10-6",null,null,null,null,null,3,9.9,"1A","1A","1A","-","- ","Skin corrosion – category 1A\nSTOT (single exposure) – category 3","Could be changed to Cat 2 based on GHS STOT hazard category, but there is no TWA WES.  It is an irritant with only a peak / ceiling value, hence remains Cat 1A.","URT irr (analogous to HCl)","1A","M"]
[null,null,302,"Hydrogen chloride (Hydrochloric acid)","7647-01-0",null,null,null,null,null,5,7.5,"1A","1A","1A","-","- ","Acute toxicity – category 3\nSkin corrosion – category 1A",null,"URT (& eye) irr","1A"]
[null,null,303,"Hydrogen cyanide (Hydrocyanic acid)","74-90-8",null,null,null,null,null,10,11,"1A","1A","1A","-","Sk ","Acute toxicity – category 2",null,"URT irr; headache; nausea; thryroid eff","1A"]
[null,null,304,"Hydrogen fluoride (as F)","7664-39-3",null,null,null,null,null,3,2.6,"1A","1A","1A","-","- ","Acute toxicity – category 1\nAcute toxicity – category 2\nSkin corrosion – category 1A",null,"URT, LRT, skin & eye irr; fluorosis","1A"]
[null,null,305,"Hydrogen peroxide","7722-84-1",1,1.4,null,null,null,null,null,"1B",2,"1B","-","- ","Acute toxicity – category 4\nSkin corrosion – category 1A\nSTOT (single exposure) – category 3","Should be a Cat 2 given GHS STOT and skin hazard categories.","Eye, URT & skin irr","1B","Y"]
[null,null,306,"Hydrogen selenide (as Se)","7783-07-5",0.05,0.16,null,null,null,null,null,4,4,"4","-","- ","-",null,"URT & eye irr; nausea",3]
[null,null,307,"Hydrogen sulphide","7783-06-4",10,14,null,15,21,null,null,"1C","1C","1C","-","- ","Acute toxicity – category 2","Possibly a Cat 2 given GHS hazard category plus low exposure concentration for fatality.","URT irr; CNS impairment",4,"M"]
[null,null,308,"Hydrogenated terphenyls","37275-59-5",0.5,4.9000000000000004,null,null,null,null,null,3,3,"3","-","- ","-",null,null,3]
[null,null,309,"Hydroquinone (p-Dihydroxybenzene)","123-31-9",null,2,null,null,null,null,null,4,4,"4","Carc. 2","-","Acute toxicity – category 4\nCarcinogenicity – category 2\nGerm cell mutagenicity – category 2\nEye damage – category 1\nSkin sensitisation – category 1",null,"Eye irr; eye damage; DSEN notation",4]
[null,null,310,"2-Hydroxypropyl acrylate","999-61-1",0.5,2.8,null,null,null,null,null,4,4,"1B","-","Sk:Sen","Acute toxicity – category 3\nSkin corrosion – category 1B\nSkin sensitisation – category 1",null,"Eye & URT irr; skin notation & sensitiser","1B"]
[null,null,311,"Indene","95-13-6",10,48,null,null,null,null,null,4,4,"1B","-","- ","-",null,"Liver damage",4]
[null,null,312,"Indium & compounds (as In)","7440-74-6",null,0.1,null,null,null,null,null,4,4,"4","-","- ","-",null,null,4]
[null,null,313,"Iodine","7553-56-2",null,null,null,null,null,0.1,1,"1A","1A","1A","-","- ","Acute toxicity – category 4",null," Hypothyroidism; URT irr","1A"]
[null,null,314,"Iodoform","75-47-8",0.6,10,null,null,null,null,null,2,2,"2","-","- ","-",null,"CNS impairment",4]
[null,null,315,"Iron oxide fume (Fe2O3) (as Fe)","1309-37-1",null,5,null,null,null,null,null,3,3,"3","-","- ","-",null,"Pneumoconiosis",3]
[null,null,316,"Iron pentacarbonyl (as Fe)","13463-40-6",0.1,0.23,null,0.2,0.45,null,null,2,2,"2","-","- ","-",null,"Pulmonary oedema; CNS impairment",4]
[null,null,317,"Iron salts, soluble (as Fe)",null,null,1,null,null,null,null,null,"1B","1B","1B","-","- ","-",null,"URT & skin irr","1B"]
[null,null,318,"Isoamyl acetate (Isopentyl acetate)","123-92-2",50,270,null,100,541,null,null,"1B","1B","1B","-","- ","-",null,null,"1B"]
[null,null,319,"Isoamyl alcohol (3-Methylbutan-1-ol)","123-51-3",100,361,null,125,452,null,null,2,2,"2","-","- ","-",null,"Eye & URT irr",4]
[null,null,320,"Isobutyl acetate","110-19-0",150,713,null,null,null,null,null,"1B","1B","1B","-","- ","STOT (single exposure) – category 3","Possibly a Cat 2 given GHS STOT hazard category.  Sparse documentation, is an irritant, acute effect of potential drowsiness.  Primarily an irritant.",null,"1B"]
[null,null,321,"Isobutyl alcohol (2-Methylpropan-1-ol; iso-Butanol)","78-83-1",50,152,null,null,null,null,null,"1B",2,"1B","-","- ","STOT (single exposure) – category 3\nSkin irritation – category 2\nEye damage – category 1","Should be a Cat 2 given GHS STOT and skin hazard categories.","Skin & eye irr","1B","Y"]
[null,null,322,"Isocyanates, all (as-NCO)",null,null,0.02,null,null,7.0000000000000007E-2,null,null,3,3,"3","See individual entries","Sen ","Respiratory sensitisation – category 1\nSkin sensitisation – category 1\nSTOT (single exposure) – category 3"]
[null,null,323,"Isooctyl alcohol","26952-21-6",50,266,null,null,null,null,null,2,2,"2","-","Sk ","-",null,"URT irr; skin notation","1B"]
[null,null,324,"Isophorone (3,5,5-Trimethylcyclohex-2-enone)","78-59-1",null,null,null,null,null,5,28,"1A","1A","1A","Carc. 2","-","Carcinogenicity – category 2\nAcute toxicity – category 4\nEye irritation – category 2A\nSTOT (single exposure) – category 3","Should be changed to Cat 4 based on GHS chronic health and acute toxicity, but there is no TWA WES.  It is an irritant with only a peak / ceiling value, hence remains Cat 1A.","Eye & URT irr; CNS impair; malaise; fatigue","1A","M"]
[null,null,325,"Isophorone diisocyanate (3-isocyanatomethyl-3,5,5-trimethylcyclohexyl isocyanate)","4098-71-9",null,0.02,null,null,7.0000000000000007E-2,null,null,3,3,"3","-","Sen","Acute toxicity – category 3\nEye irritation – category 2\nSTOT (single exposure) – category 3\nSkin irritation – category 2\nSkin sensitisation – category 1\nRespiratory sensitisation – category 1",null,"Respiratory sensitiser",4]
[null,null,326,"Isopropoxyethanol (2-(1-methylethoxy)-ethanol)","109-59-1",25,106,null,null,null,null,null,3,2,"3","-","-","Acute toxicity – category 4\nEye irritation – category 2A","Classify as 2 but could also be 1B because acute effects are mild. Cat 2 is more conservative so may be best.","Haematologic effect",4,"Y"]
[null,null,327,"Isopropyl acetate (Acetic acid, 1-methylethyl ester)","108-21-4",250,1040,null,310,1290,null,null,"1B",2,"1B","-","-","STOT (single exposure) – category 3\nEye irritation – category 2A","Is an irritant, could also argue for chronic based on skin dryness cracking. Also narcotic effect implies Cat 2 - this is most conservative so may be appropriate.","Eye & URT irr; CNS impairment","1B","Y"]
[null,null,328,"Isopropyl alcohol (Propan-2-ol)","67-63-0",400,983,null,500,1230,null,null,2,2,"2","-","-","STOT (single exposure) – category 3\nEye irritation – category 2A",null,null,"1B"]
[null,null,329,"Isopropyl ether (Diisopropyl ether)","108-20-3",250,1040,null,310,1300,null,null,"1B","1B","1B","-","-","STOT (single exposure) – category 3","Possibly a Cat 2 given GHS STOT hazard category, but primarily an irritant.","Eye & URT irr","1B"]
[null,null,330,"Isopropyl glycidyl ether (IGE, 2,3-Epoxypropyl isopropyl ether)","4016-14-2",50,238,null,75,356,null,null,3,3,"3","-","-","-",null,"URT & eye irr; dermatitis","1B"]
[null,null,331,"Isopropylamine (2-Aminopropane)","75-31-0",5,12,null,10,24,null,null,"1B",2,"1B","-","-","Acute toxicity – category 4\nAcute toxicity – category 3\nSTOT (single exposure) – category 3\nSkin corrosion – category 1A","Should be a Cat 2 given GHS STOT and skin hazard categories.","Eye & URT irr; eye damage","1B","Y"]
[null,null,332,"N-Isopropylaniline","768-52-5",2,11,null,null,null,null,null,2,2,"2","-","Sk","-",null,"MeHb-emia",4]
[null,null,333,"Kaolin ","1332-58-7",null,10,null,null,null,null,null,3,3,"3","-","-","-",null,null,3]
[null,null,334,"Ketene","463-51-4",0.5,0.86,null,1.5,2.6,null,null,2,2,"2","-","-","-",null,"URT irr; pulmonary oedema","1B"]
[null,null,335,"Lead arsenate (as Pb3(AsO4)2)","3687-31-8",null,0.15,null,null,null,null,null,4,4,"4","-","-","-",null,null,4]
[null,null,336,"Lead chromate (as Cr) ","7758-97-6",null,0.05,null,null,null,null,null,3,3,"3","Carc. 1B","-","Acute toxicity – category 3\nCarcinogenicity – category 1B\nGerm cell mutagenicity – category 2\nSTOT (repeated exposure) – category 2\nSkin sensitisation – category 1\nReproductive toxicity – category 1A",null,null,3]
[null,null,337,"Lead, inorganic dusts & fumes (as Pb)","7439-92-1",null,0.05,null,null,null,null,null,3,3,"3","-","-","Carcinogenicity – category 2\nGerm cell mutagenicity – category 2\nSTOT (repeated exposure) – category 2\nReproductive toxicity – category 1A",null,null,3]
[null,null,338,"Lindane (Gammexane, gamma-Hexachlorocyclohexane)","58-89-9",8.0000000000000002E-3,0.1,null,null,null,null,null,4,4,"4","-","Sk","Acute toxicity – category 3\nAcute toxicity – category 4\nSTOT (repeated exposure) – category 2\nReproductive toxicity – effects on or via lactation",null,null,4]
[null,null,339,"Lithium hydride","7580-67-8",null,2.5000000000000001E-2,null,null,null,null,null,"1B","1B","1B","-","-","-",null,"Eye & resp tract irr","1B"]
[null,null,340,"LPG (liquified petroleum gas)","68476-85-7",1000,1800,null,null,null,null,null,"1C",4,"1C","Carc. 1B","-","Carcinogenicity – category 1A\nGerm cell mutagenicity – category 1B","Is an asphyxiant, but also has long-term effects (see GHS classifications).","Asphyxia","1C","Y"]
[null,null,341,"Magnesite ","546-93-0",null,10,null,null,null,null,null,"1C","1C","1C","-","-","-",null,null,"1C"]
[null,null,342,"Magnesium oxide (fume)","1309-48-4",null,10,null,null,null,null,null,2,2,"2","-","-","-",null,"URT; metal fume fever",2]
[null,null,343,"Malathion (Maldison)","121-75-5",null,10,null,null,null,null,null,4,4,"4","-","Sk:Sen","Acute toxicity – category 4\nSkin sensitisation – category 1",null,"Cholinesterase inhib; skin notation",4]
[null,null,344,"Maleic anhydride","108-31-6",0.25,1,null,null,null,null,null,4,4,"4","-","Sen","Acute toxicity – category 4\nAcute toxicity – category 3\nSTOT (single exposure) – category 3\nSkin corrosion – category 1B\nRespiratory sensitisation – category 1\nSkin sensitisation – category 1",null,"Respiratory sensitiser",4]
[null,null,345,"Manganese cyclopenta-dienyl tricarbonyl (as Mn)","12079-65-1",null,0.1,null,null,null,null,null,4,4,"4","-","Sk","-",null,"Skin irr; CNS impairment; skin notation",4]
[null,null,346,"Manganese, dust & compounds (as Mn)","7439-96-5",null,1,null,null,null,null,null,3,3,4,"-","- ","STOT (repeated exposure) – category 1",null,"CNS impairment - TWA= 0.02 mg/m3 (R) & 0.1 mg/m3 (I)",3]
[null,null,347,"Manganese, fume (as Mn) (Manganese tetroxide)","7439-96-5",null,1,null,null,3,null,null,3,3,"4","-","- ","STOT (repeated exposure) – category 1",null,"CNS impairment - TWA= 0.02 mg/m3 (R) & 0.1 mg/m3 (I)",3]
[null,null,348,"Man-Made Vitreous (Silicate) Fibres - Continuous glass filament",null,null,2,null,null,null,null,null,"1B","1B","1C","Carc. 2(i)(k) or exempt(m)(n)(o)","-","-",null,"URT, skin & eye irr","1C"]
[null,null,349,"Man-Made Vitreous (Silicate) Fibres - Glass wool",null,null,2,null,null,null,null,null,"1B","1B","1C","Carc. 2(i)(k) or exempt(m)(n)(o)","-","-",null,"URT, skin & eye irr","1C"]
[null,null,350,"Man-Made Vitreous (Silicate) Fibres - High Biopersistence MMVF",null,null,2,0.5,null,null,null,null,3,3,"3","Carc. 1B (o)","-","-",null,"Pulm fibrosis; pulm function","1C"]
[null,null,351,"Man-Made Vitreous (Silicate) Fibres - Low Biopersistence MMVF",null,null,2,null,null,null,null,null,"1B","1B","1B","Carc. 2(i)(k) or exempt(m)(n)(o)","-","-",null,"URT, skin & eye irr","1C"]
[null,null,352,"Man-Made Vitreous (Silicate) Fibres - Refractory Ceramic Fibres (RCF)",null,null,2,0.5,null,null,null,null,3,3,"3","Carc. 1B (o)","-","Carcinogenicity – category 1B",null,"Pulm fibrosis; pulm function","1C"]
[null,null,353,"Man-Made Vitreous (Silicate) Fibres - Rock (stone) wool",null,null,2,null,null,null,null,null,"1B","1B","1B","Carc. 2(i)(k) or exempt(m)(n)(o)","-","Carcinogenicity – category 2","Not considered a human carcinogen - refer to AIOH Position Paper","URT, skin & eye irr","1C"]
[null,null,354,"Man-Made Vitreous (Silicate) Fibres - Slag wool",null,null,2,null,null,null,null,null,"1B","1B","1B","Carc. 2(i)(k) or exempt(m)(n)(o)","-","Carcinogenicity – category 2","Not considered a human carcinogen - refer to AIOH Position Paper","URT, skin & eye irr","1C"]
[null,null,355,"Man-Made Vitreous (Silicate) Fibres - Special Purpose Glass Fibres",null,null,2,0.5,null,null,null,null,3,3,"3","Carc. 1B (o)","-","Carcinogenicity – category 1B",null,"Pulm fibrosis; pulm function","1C"]
[null,null,356,"Mercury, alkyl compounds (as Hg)",null,null,0.01,null,null,0.03,null,null,4,4,"4","-","Sk ","Acute toxicity – category 1\nAcute toxicity – category 2\nSTOT (repeated exposure) – category 2",null,"CNS & PNS impairment; kidney damage; skin notation",4]
[null,null,357,"Mercury, aryl compounds (as Hg)",null,null,0.1,null,null,null,null,null,3,4,"3","-","Sk ","Acute toxicity – category 1\nAcute toxicity – category 2\nSTOT (repeated exposure) – category 2","Should be a 4 considering GHS classifications and ACGIH documentation for alkyl compounds.","CNS impairment; kidney damage; skin notation",4,"Y"]
[null,null,358,"Mercury, elemental vapour (as Hg)","7439-97-6",3.0000000000000001E-3,2.5000000000000001E-2,null,null,null,null,null,3,4,"3","-","- ","Acute toxicity – category 1\nReproductive toxicity – category 1B\nSTOT (repeated exposure) – category 1","Should be a 4 considering GHS classifications and ACGIH documentation for alkyl compounds.","CNS impairment; kidney damage; skin notation",null,"Y"]
[null,null,359,"Mercury, inorganic divalent compounds (as Hg)","7439-97-6",3.0000000000000001E-3,2.5000000000000001E-2,null,null,null,null,null,3,4,3,"-","- ","Acute toxicity – category 1\nReproductive toxicity – category 1B\nSTOT (repeated exposure) – category 1","Should be a 4 considering GHS classifications and ACGIH documentation for alkyl compounds.","CNS impairment; kidney damage; skin notation",null,"Y"]
[null,null,360,"Mercury, inorganic monovalent compounds (as Hg)",null,null,0.1,null,null,null,null,null,3,4,"3","-","Sk ","Acute toxicity – category 1\nAcute toxicity – category 2\nSTOT (repeated exposure) – category 2","Should be a 4 considering GHS classifications and ACGIH documentation for alkyl compounds.","CNS impairment; kidney damage; skin notation",null,"Y"]
[null,null,361,"Mesityl oxide (4-Methylpent-3-en-2-one)","141-79-7",15,60,null,25,100,null,null,"1B","1B","1B","-","- ","Acute toxicity – category 4",null,"Eye & URT irr; CNS impairment",3]
[null,null,362,"Methacrylic acid","79-41-4",20,70,null,null,null,null,null,"1B",2,"1B","-","-","Acute toxicity – category 4\nSkin corrosion – category 1A\nAcute toxicity – category 3","Should be Cat 2 based on  GHS category 1 for skin.","Skin & eye irr","1B","Y"]
[null,null,363,"Methomyl (Lannate)","16752-77-5",null,2.5,null,null,null,null,null,4,4,"4","-","-","Acute toxicity – category 2",null,"Cholinesterase inhibition; male repro damage; haematologic effect",2]
[null,null,364,"1-Methoxy-2-propanol acetate","108-65-6",50,274,null,100,548,null,null,"1B","1B",null,"-","Sk ","-",null,"(SCOEL documentation - URT irr)"]
[null,null,365,"Methoxychlor (2,2-bis(p-Methoxyphenyl)-1,1,1-trichloroethane; DMDT)","72-43-5",null,10,null,null,null,null,null,3,3,"4","-","-","-","No mention of CNS in documentation.","Liver damage; CNS impairment (based on animal studies)",3]
[null,null,366,"2-Methoxyethanol (Methyl cellosolve, Methyl gylcol, Glycol monomethyl ether, Ethylene glycol monomethyl ether)","109-86-4",5,16,null,null,null,null,null,4,4,"4","-","Sk","Acute toxicity – category 4\nReproductive toxicity – category 1B",null,"Haematological effect; repro effect; skin notation",4]
[null,null,367,"2-Methoxyethyl acetate (Ethylene glycol monomethyl ether acetate, Glycol monomethyl ether acetate, Methyl glycol acetate, Methyl cellosolve acetate)","110-49-6",5,24,null,null,null,null,null,4,4,"4","-","Sk","Acute toxicity – category 4\nReproductive toxicity – category 1B",null,"Haematological effect; repro effect; skin notation",4]
[null,null,368,"(2-Methoxymethylethoxy) propenol (Dipropylene glycol (mono) methyl ether)","34590-94-8",50,308,null,null,null,null,null,2,2,"2","-","Sk","-",null,"Eye & URT irr; CNS impairment; skin notation",4]
[null,null,369,"4-Methoxyphenol (Mequinol (INN))","150-76-5",null,5,null,null,null,null,null,4,4,"1B","-","Sen","Acute toxicity – category 4\nEye irritation – category 2\nSkin sensitisation – category 1",null,"Eye irr; skin damage",4]
[null,null,370,"Methyl 2-cyanoacrylate (mecrilate)","137-05-3",2,9.1,null,4,18,null,null,"1B","1B","3","-","-","Eye irritation – category 2\nSTOT (single exposure) – category 3\nSkin irritation – category 2","Possibly a Cat 2 given GHS STOT hazard category, but primarily an irritant.","URT & eye irr (& possible sensitisation)","1B","M"]
[null,null,371,"Methyl acetate","79-20-9",200,606,null,250,757,null,null,2,2,"2","-","-","Eye irritation – category 2\nSTOT (single exposure) – category 3",null,null,4]
[null,null,372,"Methyl acetylene (Propyne)","74-99-7",1000,1640,null,null,null,null,null,"1C","1C","1C","-","-","-",null,"CNS impairment",2]
[null,null,373,"Methyl acetylene-propadiene mixture (MAPP)","59355-75-8",1000,1640,null,1250,2050,null,null,"1C","1C","1C","-","-","-",null,"CNS impairment",2]
[null,null,374,"Methyl acrylate (Acrylic acid, methyl ester)","96-33-3",10,35,null,null,null,null,null,3,3,"3","-","Sk:Sen","Acute toxicity – category 4\nAcute toxicity – category 3\nEye irritation – category 2A\nSkin irritation – category 2\nSTOT (single exposure) – category 3\nSkin sensitisation – category 1",null,"Eye, skin & URT irr; eye damage","1B"]
[null,null,375,"Methyl alcohol (Methanol)","67-56-1",200,262,null,250,328,null,null,4,2,"4",null,"Sk","Acute toxicity – category 3\nSTOT (single exposure) – category 1","Should be Cat 2 given GHS STOT hazard category and ACGIH documentation.  No mention of long-term effects!","Headache; eye damage; dizziness; nausea; skin notation",4,"Y"]
[null,null,376,"N-Methyl aniline","100-61-8",0.5,2.2000000000000002,null,null,null,null,null,4,4,"4",null,"Sk","Acute toxicity – category 3\nSTOT (repeated exposure) – category 2",null,"MeHb-emia; CNS impairment; skin notation",4]
[null,null,377,"Methyl bromide (Bromomethane)","74-83-9",5,19,null,null,null,null,null,4,4,"4",null,"Sk","Germ cell mutagenicity – category 2\nAcute toxicity – category 3\nEye irritation – category 2\nSTOT (single exposure) – category 3\nSkin irritation – category 2\nSTOT (repeated exposure) – category 2",null,"URT & skin irr; skin notation",4]
[null,null,378,"Methyl chloride (Chloromethane)","74-87-3",50,103,null,100,207,null,null,4,4,"4","Carc. 2","-","Acute toxicity – category 4\nCarcinogenicity – category 2\nSTOT(repeated exposure) – category 2",null,"CNS impairment; liver, kidney & testicular damage; teratogenic effect; skin notation",4]
[null,null,379,"Methyl demeton (Demeton-O-methyl plus demeton-S-methyl; Metasystox)","8022-00-2",null,0.5,null,null,null,null,null,4,4,"4","-","Sk","-",null,"Cholinesterase inhibition; skin notation",4]
[null,null,380,"Methyl ethyl ketone (MEK, 2-Butanone)","78-93-3",150,445,null,300,890,null,null,"1B",2,"1B","-","- ","Eye irritation – category 2A\nSTOT (single exposure) – category 3","Is an irritant, could argue for chronic based on skin dryness cracking. Also narcotic effect implies Cat 2 - this is most conservative so may be appropriate.","URT irr; CNS & PNS impairment",4,"Y"]
[null,null,381,"Methyl ethyl ketone peroxide (2-Butanone, peroxide)","1338-23-4",null,null,null,null,null,0.2,1.5,"1A","1A","1A","-","- ","Acute toxicity – category 4\nSkin corrosion – category 1B\nGerm cell mutagenicity – category 2\nSTOT (single exposure) – category 3","Could be changed to Cat 2 based on GHS STOT hazard category, but there is no TWA WES.  It is an irritant with only a peak / ceiling value, hence remains Cat 1A.","Eye & skin irr; liver & kidney damage","1A","M"]
[null,null,382,"Methyl formate (Formic acid, methyl ester)","107-31-3",100,246,null,150,368,null,null,"1B",2,"1B","-","- ","Acute toxicity – category 4\nEye irritation – category 2\nSTOT (single exposure) – category 3","Should be Cat 2 given GHS STOT hazard category.","CNS impairment; URT irr; eye damage","1B","Y"]
[null,null,383,"Methyl hydrazine","60-34-4",0.01,1.9E-2,null,null,null,null,null,4,4,"1A","-","Sk ","Acute toxicity – category 2\nAcute toxicity – category 1\nCarcinogenicity – category 1B\nSTOT (repeated exposure) – category 1",null,"URT & eye irr; lung cancer; liver damage; skin notation",4]
[null,null,384,"Methyl iodide (Iodomethane)","74-88-4",2,12,null,null,null,null,null,4,4,"4","Carc. 2","Sk ","Acute toxicity – category 3\nCarcinogenicity – category 2\nEye damage – category 1\nSkin irritation – category 2\nSTOT (single exposure) – category 3",null,"Eye damage; CNS impairment; skin notation",4]
[null,null,385,"Methyl isoamyl ketone (Isoamyl methyl ketone; 5-Methyl-2-hexanone)","110-12-3",50,234,null,null,null,null,null,"1B","1B","1B","-","- ","Acute toxicity – category 4",null,"CNS impairment; URT irr",4]
[null,null,386,"Methyl isobutyl carbinol (Methyl amyl alcohol; 4-methyl-2-Pentanol)","108-11-2",25,104,null,40,167,null,null,"1B",2,"1B","-","Sk ","Acute toxicity – category 4\nEye irritation – category 2A\nSkin irritation – category 2\nSTOT (single exposure) – category 3","Is an irritant, also harmful if inhaled with GHS STOT hazard category implies Cat 2","URT & eye irr; CNS impairment; skin notation","1B","Y"]
[null,null,387,"Methyl isobutyl ketone (MIBK, Hexone, 4-Methyl-2-pentanone)","108-10-1",50,205,null,75,307,null,null,"1B",2,"1B","-","- ","Acute toxicity – category 4\nCarcinogenicity – category 2\nEye irritation – category 2A\nSTOT (single exposure) – category 3","Is an irritant, but also CNS and GI (ACGIH) with GHS STOT hazard category implies Cat 2","URT irr; dizziness; headache",4,"Y"]
[null,null,388,"Methyl isocyanate","624-83-9",null,0.02,null,null,7.0000000000000007E-2,null,null,3,4,"3","-","Sen ","Acute toxicity – category 3\nSkin corrosion – category 1B\nRespiratory sensitisation – category 1\nSkin sensitisation – category 1\nGerm cell mutagenicity – category 2\nReproductive toxicity – category 2\nSTOT (single exposure) – category 3\nSTOT (repeated exposure) – category 1","Change to 4 based on GHS & ACGIH chronic health and acute toxicity. Also an irritant.","URT & eye irr; skin & DSEN notation",4,"Y"]
[null,null,389,"Methyl isopropyl ketone (3-Methyl-2-butanone)","563-80-4",200,705,null,null,null,null,null,"1B",4,"1B","-","- ","-","Change to 4 given ACGIH documentation - both acute and chronic effects.","Embryo / foetal damage; neonatal toxicity","1B","Y"]
[null,null,390,"Methyl mercaptan (Methanethiol)","74-93-1",0.5,0.98,null,null,null,null,null,"1B",4,"1B","-","- ","Acute toxicity – category 3","Change to 4 given ACGIH documentation - both acute and chronic effects.","Liver damage, systemic","1B","Y"]
[null,null,391,"Methyl methacrylate (Methacrylic acid, methyl ester)","80-62-6",50,208,null,100,416,null,null,4,4,"1B","-","Sen ","Skin irritation – category 2\nSTOT (single exposure) – category 3\nSkin sensitisation – category 1",null,"URT & eye irr; body weight effects; pulmonary oedema; sensitiser",2]
[null,null,392,"Methyl n-amyl ketone (2-Heptanone; Heptan-2-one)","110-43-0",50,233,null,null,null,null,null,"1B","1B","1B","-","- ","Acute toxicity – category 4",null,"Eye & skin irr",4]
[null,null,393,"Methyl n-butyl ketone (2-Hexanone)","591-78-6",5,20,null,null,null,null,null,3,3,"3","-","Sk ","Reproductive toxicity – category 2\nSTOT (single exposure) – category 3\nSTOT (repeated exposure) – category 1",null,"Peripheral neuropothy; testicular damage",4]
[null,null,394,"Methyl parathion","298-00-0",null,0.2,null,null,null,null,null,4,4,"4","-","Sk ","Acute toxicity – category 2\nAcute toxicity – category 3\nSTOT (repeated exposure) – category 2",null,"Cholinesterase inhibition",4]
[null,null,395,"Methyl propyl ketone (2-Pentanone)","107-87-9",200,705,null,250,881,null,null,2,2,"2","-","- ","-",null,null,2]
[null,null,396,"Methyl silicate (Tetramethyl orthosilicate)","681-84-5",1,6,null,null,null,null,null,2,2,"2","-","- ","-",null,"URT irr; eye damage","1B"]
[null,null,397,"alpha-Methyl styrene (2-Phenylpropene)","98-83-9",50,242,null,100,483,null,null,2,4,"2","-","- ","Eye irritation – category 2A\nCarcinogenicity – category 2\nSTOT (single exposure) – category 3","Change to 4 based on ACGIH classification and GHS chronic health (cancer) and acute toxicity.","URT irr; kidney damage; female repro damage",4,"Y"]
[null,null,398,"1-Methyl-2-pyrrolidone","872-50-4",25,103,null,75,309,null,null,4,4,null,"-","Sk ","Eye irritation – category 2A\nSkin irritation – category 2\nSTOT (single exposure) – category 3\nReproductive toxicity – category 1B",null,"(SCOEL documentation - URT irr; chemosensory effects; reproductive toxicity)"]
[null,null,399,"Methylacrylonitrile","126-98-7",1,2.7,null,null,null,null,null,4,4,"4","-","Sk:Sen","Acute toxicity – category 3\nSkin sensitisation – category 1",null,"CNS impairment; eye & skin irr; skin notation",4]
[null,null,400,"Methylal (Dimethoxymethane)","109-87-5",1000,3110,null,null,null,null,null,"1B","1B","1B","-","- ","-",null,"Eye irr; CNS impairment",4]
[null,null,401,"Methylamine ","74-89-5",10,13,null,null,null,null,null,"1B",2,"1B","-","- ","Acute toxicity – category 4\nSTOT (single exposure) – category 3\nEye damage – category 1\nSkin irritation – category 2","Should be a Cat 2 given GHS STOT, eye and skin hazard categories, although ACGIH documentation is for irritation only.","Eye, skin & URT irr","1B","Y"]
[null,null,402,"Methylcyclohexane","108-87-2",400,1610,null,null,null,null,null,"1B",2,"1B","-","- ","Skin irritation – category 2\nSTOT (single exposure) – category 3","Possibly a Cat 2 given GHS STOT hazard category and ACGIH documentation is based on analogy to heptane acute effects.","URT irr; CNS impairment; liver & kidney damage",4,"Y"]
[null,null,403,"Methylcyclohexanol","25639-42-3",50,234,null,null,null,null,null,3,4,"3","-","- ","Acute toxicity – category 4","Should be Cat 4 given GHS / ACGIH acute effects & ACGIH longer-term effects on rabbits.  There were no human long-term effects documented, just irritation.","URT & eye irr + histologic changes to rabbit liver & kidney",4,"Y"]
[null,null,404,"o-Methylcyclohexanone","583-60-8",50,229,null,75,344,null,null,"1B","1B","1B","-","Sk ","Acute toxicity – category 4",null,"URT & eye irr; CNS impairment; skin notation","1B"]
[null,null,405,"Methylcyclopentadienyl manganese tricarbonyl (as Mn)","12108-13-3",null,0.2,null,null,null,null,null,4,4,"4","-","Sk ","Acute toxicity – category 1\nSTOT (repeated exposure) – category 1",null,"CNS impairment; lung, liver & kidney damage",4]
[null,null,406,"4,4’-Methylene bis (2-chloroaniline) (MOCA, MBOCA, 2,2'-Dichloro-4,4'-methylenedianiline)","101-14-4",0.02,0.22,null,null,null,null,null,4,4,"4","Carc. 1B","Sk","Acute toxicity – category 4\nCarcinogenicity – category 1B\nGerm cell mutagenicity – category 2",null,"Bladder cancer; MeHb-emia; skin notation",3]
[null,null,407,"Methylene bis (4-cyclo-hexylisocyanate)","5124-30-1",null,0.02,null,null,7.0000000000000007E-2,null,null,3,3,"3","-","Sen","Acute toxicity – category 3\nEye irritation – category 2\nSTOT (single exposure) – category 3\nSkin irritation – category 2\nSkin sensitisation – category 1\nRespiratory sensitisation – category 1",null,"Respiratory sensitiser; LRT irr","1B"]
[null,null,408,"Methylene bisphenyl isocyanate (MDI, Diphenylmethane diisocyanate)","101-68-8",null,0.02,null,null,7.0000000000000007E-2,null,null,3,4,"3","Carc. 2","Sen","Acute toxicity – category 2\nCarcinogenicity – category 2\nEye irritation – category 2A\nSkin irritation – category 2\nSTOT (repeated exposure) – category 1\nRespiratory sensitisation – category 1\nSkin sensitisation – category 1\nSTOT (single exposure) – category 3","Has acute (irritant) as well as chronic (cancer & sensitiser) effects.","Respiratory sensitiser",4,"Y"]
[null,null,409,"Methylene chloride (Dichloromethane)","75-09-2",50,174,null,null,null,null,null,4,4,"4","Carc. 2","Sk","STOT (single exposure) – category 3\nCarcinogenicity – category 2\nEye irritation – category 2A\nSkin irritation – category 2",null,"COHb-emia; CNS impairment",2]
[null,null,410,"4,4'-Methylene dianiline (MDA, DADPM, DDM, p,p'-Diaminodiphenylmethane)","101-77-9",0.1,0.81,null,null,null,null,null,3,3,"3","Carc. 1B","Sk:Sen","STOT (single exposure) – category 1\nCarcinogenicity – category 1B\nGerm cell mutagenicity – category 1A\nSTOT (repeated exposure) – category 2\nSkin sensitisation – category 1",null,"Liver damage; skin notation",3]
[null,null,411,"5-Methylheptan-3-one (Ethyl amyl ketone)","541-85-5",10,53,null,20,107,null,null,"1B",2,"1B","-","- ","Eye irritation – category 2\nSTOT (single exposure) – category 3","Should be Cat 2 given GHS STOT hazard category and ACGIH documentation of neurotoxic effects.","Neurotoxicity","1B","Y"]
[null,null,412,"Methyl-tert butyl ether","1634-04-4",25,92,null,75,275,null,null,4,4,"4","-","- ","Skin irritation – category 2","Said to have both short and long-term effects in PubChem.","No data",4]
[null,null,413,"Metribuzin (Sencor)","21087-64-9",null,5,null,null,null,null,null,2,2,"2","-","- ","Acute toxicity – category 4",null,"Liver damage; haematological effect",4]
[null,null,414,"Mevinphos (Phosdrin)","7786-34-7",0.01,9.1999999999999998E-2,null,0.03,0.27,null,null,4,4,"4","-","Sk ","Acute toxicity – category 1\nAcute toxicity – category 2",null,"Cholinesterase inhibition",4]
[null,null,415,"Mica","12001-26-2",null,2.5,null,null,null,null,null,3,3,"3","-","- ","-",null,"Pneumoconiosis",3]
[null,null,416,"Mineral turpentine",null,null,480,null,null,null,null,null,4,4,null,"-","- ","-",null,"Eye, skin & kidney damage; nausea; CNS impairment",2]
[null,null,417,"Molybdenum, insoluble compounds (as Mo)","7439-98-7",null,10,null,null,null,null,null,"1C","1C","1C","-","- ","-",null,"LRT irr",4]
[null,null,418,"Molybdenum, soluble compounds (as Mo)","7439-98-7",null,5,null,null,null,null,null,"1C","1C","1C","-","- ","-",null,"LRT irr",4]
[null,null,419,"Monochloroacetic acid","79-11-8",0.3,1.2,null,null,null,null,null,"1B",2,null,"-","Sk ","Acute toxicity – category 3\nSkin corrosion – category 1B","Should be Cat 2 given GHS hazard category 1 for skin.","(SCOEL documentation - eye & skin irr; chemical burns; no data to support health-based OEL)",null,"Y"]
[null,null,420,"Monocrotophos (Azodrin)","6923-22-4",null,0.25,null,null,null,null,null,4,4,"4","-","- ","Germ cell mutagenicity – category 2\nAcute toxicity – category 2\nAcute toxicity – category 3",null,"Cholinesterase inhib; skin notation",2]
[null,null,421,"Morpholine","110-91-8",20,71,null,null,null,null,null,"1B",2,"1B","-","Sk ","Acute toxicity – category 4\nSkin corrosion – category 1","Should be Cat 2 given GHS hazard category 1 for skin.","Eye damage; URT irr; skin notation","1B","Y"]
[null,null,422,"Naled (Dibrom; Dimethyl-1,2-dibromo-2,2-dichloroethylphosphate)","300-76-5",null,3,null,null,null,null,null,4,4,"4","-","Sk ","Acute toxicity – category 4\nEye irritation – category 2\nSkin irritation – category 2",null,"Cholinesterase inhibition; skin & DSEN notation",4]
[null,null,423,"Naphthalene","91-20-3",10,52,null,15,79,null,null,4,4,"1B","Carc. 2","- ","Acute toxicity – category 4\nCarcinogenicity – category 2\nSTOT (single exposure) – category 3",null,"URT irr; cataracts; haemolitic anaemia; skin notation",4]
[null,null,424,"Nickel carbonyl (as Ni) (Tetracarbonyl nickel)","13463-39-3",0.05,0.12,null,null,null,null,null,2,4,"2","Carc. 2","- ","Carcinogenicity – category 2\nReproductive toxicity – category 1B\nAcute toxicity – category 2","Has acute as well as chronic (Carc) effects.","Lung irr; ceiling value assigned",4,"Y"]
[null,null,425,"Nickel dichloride","7718-54-9",null,0.1,null,null,null,null,null,3,3,null,"Carc. 1A","-","Acute toxicity – category 4\nAcute toxicity – category 3\nCarcinogenicity – category 1A\nGerm cell mutagenicity – category 2\nSTOT (repeated exposure) – category 1\nReproductive toxicity – category 1B\nRespiratory sensitisation – category 1\nSkin irritation – category 2\nSkin sensitisation – category 1","Main effect is chronic - some acute effects - but at lower end. Also a sensitiser. Could be 3 or 4","Lung damage; nasal cancer (based on soluble compounds)",3,"M"]
[null,null,426,"Nickel dinitrate","13138-45-9",null,0.1,null,null,null,null,null,3,3,null,"Carc. 1A","-","Acute toxicity – category 4\nCarcinogenicity – category 1A\nEye damage – category 1\nSkin irritation – category 2\nSTOT (repeated exposure) – category 1\nRespiratory sensitisation – category 1\nSkin sensitisation – category 1\nGerm cell mutagenicity – category 2\nReproductive toxicity – category 1B","Main effect is chronic - some acute effects - but at lower end. Also a sensitiser. Could be 3 or 4","Lung damage; nasal cancer (based on soluble compounds)",3,"M"]
[null,null,427,"Nickel, metal","7440-02-0",null,1,null,null,null,null,null,3,3,"3","Carc. 2","Sen","Carcinogenicity – category 2\nSTOT (repeated exposure) – category 1\nSkin sensitisation – category 1",null,"Dermatitis; pneumoconiosis",4]
[null,null,428,"Nickel, powder","7440-02-0",null,1,null,null,null,null,null,3,3,"3","Carc. 2","-","Carcinogenicity – category 2\nSTOT (repeated exposure) – category 1\nSkin sensitisation – category 1",null,"Lung cancer",4]
[null,null,429,"Nickel salt, nitric acid","14216-75-2",null,0.1,null,null,null,null,null,3,3,null,"Carc. 1A","-","Carcinogenicity – category 1A\nGerm cell mutagenicity – category 2\nReproductive toxicity – category 1B\nAcute toxicity – category 4\nSkin irritation – category 2\nRespiratory sensitisation – category 1\nSkin sensitisation – category 1\nSTOT (repeated exposure) – category 1\nEye damage – category 1",null,"Lung damage; nasal cancer (based on soluble compounds)",3]
[null,null,430,"Nickel, soluble compounds (as Ni)","7440-02-0",null,0.1,null,null,null,null,null,3,3,"3","See Notes","Sen","Carcinogenicity – category 2\nSTOT (repeated exposure) – category 1\nSkin sensitisation – category 1",null,"Lung damage; nasal cancer",3]
[null,null,431,"Nickel sulphide roasting (fume & dust) (as Ni)",null,null,1,null,null,null,null,null,3,3,"3","Carc. 1A","Sen","-",null,"Lung cancer",3]
[null,null,432,"Nicotine","54-11-5",null,0.5,null,null,null,null,null,2,2,"2","-","Sk ","Acute toxicity – category 1\nAcute toxicity – category 3",null,"GI damage; CNS impairment; cardiac impairment",4]
[null,null,433,"Nitrapyrin (N-Serve; 2-Chloro-6-(trichloromethyl) pyridine)","1929-82-4",null,10,null,null,20,null,null,"1C",3,"1C","-","- ","Acute toxicity – category 4\nEye irritation – category 2A\nCarcinogenicity – category 2\nSkin sensitisation – category 1","Carcinogenicity, sensitisation and liver damage suggest Cat 3.","Liver damage","1C","Y"]
[null,null,434,"Nitric acid","7697-37-2",2,5.2,null,4,10,null,null,2,2,"2","-","- ","Skin corrosion – category 1\nOxidising liquid – category 2",null,"URT & eye irr; dental erosion","1B"]
[null,null,435,"Nitric oxide (Nitrogen monoxide)","10102-43-9",25,31,null,null,null,null,null,2,2,"2","-","- ","-",null,"Hypoxia / cyanosis; nitrosyl-Hb form; URT irr",2]
[null,null,436,"p-Nitroaniline","100-01-6",null,3,null,null,null,null,null,4,4,"4","-","Sk ","Acute toxicity – category 3\nSTOT (repeated exposure) – category 2",null,"MeHb-emia; liver damage; eye irr; skin notation",4]
[null,null,437,"Nitrobenzene","98-95-3",1,5,null,null,null,null,null,4,4,"4","Carc. 2","Sk","Acute toxicity – category 3\nCarcinogenicity – category 2\nReproductive toxicity – category 2\nSTOT (repeated exposure) – category 1","SCOEL - also experimental tumourogenicity","MeHb-emia; skin notation",4]
[null,null,438,"p-Nitrochlorobenzene (p-Chloronitrobenzene; 1-chloro-4-nitrobenzene)","100-00-5",0.1,0.64,null,null,null,null,null,4,4,"4","Carc. 2","Sk","Carcinogenicity – category 2\nGerm cell mutagenicity – category 2\nAcute toxicity – category 3\nSTOT (repeated exposure) – category 2",null,"MeHb-emia; skin notation",4]
[null,null,439,"Nitroethane","79-24-3",100,307,null,null,null,null,null,"1B","1B","1B","-","-","Acute toxicity – category 4","TLV / WES set to prevent irritation effects.  Other effects occur at much higher exposures.","URT irr; CNS impairment; liver damage","1B"]
[null,null,440,"Nitrogen dioxide","10102-44-0",3,5.6,null,5,9.4,null,null,4,"1B","4","-","-","Acute toxicity – category 2\nSkin corrosion – category 1B","TLV is set to protect from respiratory tract irritation, hence Cat 1B.  Asthmatics are more sensitive.","LRT irr",4,"Y"]
[null,null,441,"Nitrogen trifluoride","7783-54-2",10,29,null,null,null,null,null,2,2,"2","-","-","-",null,"MeHb-emia; liver & kidney damage",4]
[null,null,442,"Nitroglycerin (NG, Glyceryl trinitrate)","55-63-0",0.05,0.46,null,null,null,null,null,2,2,"1A","-","Sk ","Acute toxicity – category 1\nAcute toxicity – category 2\nSTOT (repeated exposure) – category 2",null,"Vasodilation; skin notation",4]
[null,null,443,"Nitromethane","75-52-5",20,50,null,null,null,null,null,4,4,"4","-","-","Acute toxicity – category 4",null,"Thyroid effect; URT irr; lung damage",3]
[null,null,444,"1-Nitropropane","108-03-2",25,91,null,null,null,null,null,3,3,"3","-","-","Acute toxicity – category 4",null,"URT & eye irr; liver damage","1B"]
[null,null,445,"2-Nitropropane","79-46-9",10,36,null,null,null,null,null,3,3,"3","Carc. 1B","-","Acute toxicity – category 4\nCarcinogenicity – category 1B\nGerm cell mutagenicity – category 2","As for Nickel dinitrate - Main effect is chronic - some acute effects - but at lower end. Also a sensitiser. Could be 3 or 4","Liver damage; liver cancer",4,"M"]
[null,null,446,"2-Nitrotoluene","88-72-2",2,11,null,null,null,null,null,4,3,"2","Carc. 1B","Sk","Carcinogenicity – category 1B\nGerm cell mutagenicity – category 1B\nReproductive toxicity – category 2\nAcute toxicity – category 4","Acute toxicity is harmful only - there is also an argument to stay at 4.","MeHb-emia; skin notation",3,"Y"]
[null,null,447,"3-Nitrotoluene","99-08-1",2,11,null,null,null,null,null,2,2,"2","-","Sk","-",null,"MeHb-emia",3]
[null,null,448,"4-Nitrotoluene","99-99-0",2,11,null,null,null,null,null,2,2,"2","-","Sk","Acute toxicity – category 3\nSTOT (repeated exposure) – category 2",null,"MeHb-emia",3]
[null,null,449,"Nitrous oxide (Dinitrogen monoxide, Laughing gas)","10024-97-2",25,45,null,null,null,null,null,3,3,"3","-","-","-",null,"CNS impairment; haematological effect; embryo / foetal damage",4]
[null,null,450,"Nonane","111-84-2",200,1050,null,null,null,null,null,2,2,"2","-","-","-",null,"CNS impairment","1B"]
[null,null,451,"Octachloronaphthalene","2234-13-1",null,0.1,null,null,0.3,null,null,3,3,"3","-","Sk ","-",null,"Liver damage; skin notation",3]
[null,null,452,"Octane","111-65-9",300,1400,null,375,1750,null,null,2,2,"2","-","- ","Skin irritation – category 2\nSTOT (single exposure) – category 3",null,"URT irr",2]
[null,null,453,"Oil mist, refined mineral","8012-95-1",null,5,null,null,null,null,null,3,3,"3","-","- ","-","Given ACGIH documentation, should be Cat 1B, but depends on type of oil mist.  Could have acute or chronic effects.","URT irr",1,"M"]
[null,null,454,"Osmium tetroxide (as Os)","20816-12-0",2.0000000000000001E-4,1.6000000000000001E-3,null,5.9999999999999995E-4,4.7000000000000002E-3,null,null,"1B","1B","1B","-","- ","Acute toxicity – category 1\nAcute toxicity – category 2\nSkin corrosion – category 1B",null,"Eye, URT & skin irr","1B"]
[null,null,455,"Oxalic acid","144-62-7",null,1,null,null,2,null,null,"1B","1B","1B","-","- ","Acute toxicity – category 4\nSkin corrosion – category 1B\nSTOT (repeated exposure) – category 2","Possibly a Cat 4 given GHS STOT hazard category and irritant properties.","URT, eye & skin irr","1B","M"]
[null,null,456,"2,2'-Oxybis[ethanol] (Diethylene glycol)","111-46-6",23,100,null,null,null,null,null,2,2,null,"-","- ","Acute toxicity – category 4","UK HSE documentation - oxaluria & kidney damage.","No data"]
[null,null,457,"Oxygen difluoride","7783-41-7",null,null,null,null,null,0.05,0.11,"1A","1A","1A","-","- ","-",null,"Headache; pulm edema; URT irr","1A"]
[null,null,458,"Ozone","10028-15-6",null,null,null,null,null,0.1,0.2,"1A","1A","1A","-","- ","-",null,"Pulmonary function",2]
[null,null,459,"Paraffin wax (fume)","8002-74-2",null,2,null,null,null,null,null,"1B","1B","1B","-","- ","-",null,"URT irr; nausea","1B"]
[null,null,460,"Paraquat (respirable sizes) (Paraquat dichloride (ISO))","4685-14-7",null,0.1,null,null,null,null,null,3,4,"3","-","- ","Acute toxicity – category 2\nAcute toxicity – category 3\nSTOT (repeated exposure) – category 1\nSTOT (single exposure) – category 3\nSkin irritation – category 2\nEye irritation – category 2","Should be Cat 4 given GHS acute effects classification.","Lung damage",4,"Y"]
[null,null,461,"Parathion","56-38-2",null,0.1,null,null,null,null,null,4,4,"4","-","Sk ","Acute toxicity – category 2\nAcute toxicity – category 3\nSTOT (repeated exposure) – category 1",null,"Cholinesterase inhib; skin notation",4]
[null,null,462,"PCBs (42% Chlorine) (Polychlorinated biphenyls, Polychlorobiphenyls, Chlorobiphenyl)","53469-21-9?",null,1,null,null,2,null,null,3,3,"3","-","Sk","STOT (repeated exposure) – category 2",null,null,3]
[null,null,463,"PCBs (54% Chlorine) (Chlorobiphenyl)","11097-69-1?",null,0.5,null,null,1,null,null,3,3,"3","-","Sk ","STOT (repeated exposure) – category 2",null,null,3]
[null,null,464,"Pentaborane","19624-22-7",5.0000000000000001E-3,1.2999999999999999E-2,null,1.4999999999999999E-2,3.9E-2,null,null,2,2,"2","-","- ","-",null,"CNS convulsions & impairment",4]
[null,null,465,"Pentachloronaphthalene","1321-64-8",null,0.5,null,null,null,null,null,3,3,"3","-","- ","Acute toxicity – category 4\nEye irritation – category 2\nSkin irritation – category 2",null,"Liver damage; chloracne; skin notation",3]
[null,null,466,"Pentachloronitrobenzene (quintozene)","82-68-8",null,0.5,null,null,null,null,null,3,3,"3","-","Sen","Skin sensitisation – category 1",null,"Liver damage",3]
[null,null,467,"Pentachlorophenol","87-86-5",null,0.5,null,null,null,null,null,4,4,"3","Carc. 2","Sk","Carcinogenicity – category 2\nAcute toxicity – category 2\nAcute toxicity – category 3\nSTOT (single exposure) – category 3\nSkin irritation – category 2\nEye irritation – category 2",null,"URT & eye irr; CNS & cardiac impairment",4]
[null,null,468,"Pentaerythritol ","115-77-5",null,10,null,null,null,null,null,"1C","1C","1C","-","-","-",null,"GI irr","1C"]
[null,null,469,"Pentane","109-66-0",600,1770,null,750,2210,null,null,2,2,"2","-","-","STOT (single exposure) – category 3",null,"Narcosis; resp tract irr",4]
[null,null,470,"Perchloroethylene (Tetrachloroethylene)","127-18-4",50,340,null,150,1020,null,null,4,4,"4","-","-","Carcinogenicity – category 2",null,"CNS impairment",4]
[null,null,471,"Perchloromethyl mercaptan","594-42-3",0.1,0.76,null,null,null,null,null,2,2,"2","-","-","-",null,"Eye & URT irr","1B"]
[null,null,472,"Perchloryl fluoride","7616-94-6",3,13,null,6,25,null,null,4,4,"4","-","-","-",null,"LRT & URT irr; MeHb-emia; fluorosis",4]
[null,null,473,"Perfluoroisobutylene (Octafluoroisobutylene)","382-21-8",null,null,null,null,null,0.01,8.2000000000000003E-2,"1A","1A","1A","-","-","-",null,"URT irr; haematologic eff"]
[null,null,474,"Perlite dust ","93763-70-3",null,10,null,null,null,null,null,"1C","1C","1C","-","-","-",null,null,"1C"]
[null,null,475,"Petrol (gasoline)","8002-05-9",null,900,null,null,null,null,null,2,4,"2","-","-","Germ cell mutagenicity – category 1B\nCarcinogenicity – category 1B\nReproductive toxicity – category 2","Has chronic effect as well as acute effects.","URT & eye irr; CNS impairment",2,"Y"]
[null,null,476,"Phenol","108-95-2",1,4,null,null,null,null,null,4,4,"4","-","Sk","Germ cell mutagenicity – category 2\nAcute toxicity – category 3\nSkin corrosion – category 1B\nSTOT (repeated exposure) – category 2",null,"URT irr; lung damage; CNS impairment; skin notation",4]
[null,null,477,"Phenothiazine","92-84-2",null,5,null,null,null,null,null,3,3,"3","-","Sk","-",null,"Eye photosensitisation; skin irr",4]
[null,null,478,"Phenyl ether (vapour) (Diphenyl ether)","101-84-8",1,7,null,2,14,null,null,"1B","1B","1B","-","-","-","SCOEL documentation - URT & eye irr; no acute health hazard","No data","1B"]
[null,null,479,"Phenyl glycidyl ether (PGE; Phenyl-2,3-epoxypropyl ether; Oxirane, (phenoxymethyl)-)","122-60-1",1,6.1,null,null,null,null,null,3,3,"3","Carc. 1B","Sen","Acute toxicity – category 4\nCarcinogenicity – category 1B\nGerm cell mutagenicity – category 2\nEye irritation – category 2A\nSTOT (single exposure) – category 3\nSkin irritation – category 2\nSkin sensitisation – category 1","Has acute effects &  could consider 4 but acute is at warning level,","Testicular damage",4,"M"]
[null,null,480,"Phenyl mercaptan (Benzenethiol)","108-98-5",0.5,2.2999999999999998,null,null,null,null,null,"1B","1B","1B","-","- ","-",null,"CNS impairment; eye & skin irr",4]
[null,null,481,"m-Phenylenediamine (1,3-Benzenediamine)","108-45-2",null,0.1,null,null,null,null,null,3,4,"3","-","Sk:Sen","Germ cell mutagenicity – category 2\nAcute toxicity – category 3\nSkin sensitisation – category 1\nEye irritation – category 2A","Has acute toxic effects as well as chronic effects",null,3,"Y"]
[null,null,482,"o-Phenylenediamine (1,2-Benzenediamine)","95-54-5",null,0.1,null,null,null,null,null,3,4,"3","Carc. 2","Sen","Carcinogenicity – category 2\nGerm cell mutagenicity – category 2\nAcute toxicity – category 3\nAcute toxicity – category 4\nEye irritation – category 2A\nSkin sensitisation – category 1","Has acute effects & could consider 4 but acute inhalation plus toxicity by inhalation is at warning level.","Anemia",4,"Y"]
[null,null,483,"p-Phenylenediamine (1,4-Benzenediamine)","106-50-3",null,0.1,null,null,null,null,null,3,4,"3","-","Sen","Acute toxicity – category 3\nEye irritation – category 2A\nSkin sensitisation – category 1","Acute toxicity is Category 3; implies adjustment category 4","URT irr; skin sensitiser",4,"Y"]
[null,null,484,"Phenylhydrazine","100-63-0",0.1,0.44,null,null,null,null,null,4,4,"3","Carc. 1B","Sk:Sen","Acute toxicity – category 3\nCarcinogenicity – category 1B\nGerm cell mutagenicity – category 2\nEye irritation – category 2A\nSkin irritation – category 2\nSTOT (repeated exposure) – category 1\nSkin sensitisation – category 1",null,"Anemia; URT & skin irr",4]
[null,null,485,"Phenylphosphine","638-21-1",null,null,null,null,null,0.05,0.23,"1A","1A","1A","-","-","-",null,"Dermatitis; haematologic eff; testicular damage","1A"]
[null,null,486,"Phorate (Thimet)","298-02-2",null,0.05,null,null,0.2,null,null,4,4,"4","-","Sk","Acute toxicity – category 1\nAcute toxicity – category 2",null,"Cholinesterase inhibition",4]
[null,null,487,"Phosgene (Carbonyl chloride)","75-44-5",0.02,0.08,null,0.06,0.25,null,null,2,2,"2","-","-","Acute toxicity – category 2\nSkin corrosion – category 1B",null,"URT irr; pulmonary oedema; pulmonary emphysema",4]
[null,null,488,"Phosphine","7803-51-2",0.3,0.42,null,1,1.4,null,null,2,2,"2","-","-","Acute toxicity – category 2\nSkin corrosion – category 1B",null,"URT & GI irr; headache; CNS impairment",4]
[null,null,489,"Phosphoric acid (Orthophosphoric acid)","7664-38-2",null,1,null,null,3,null,null,"1B","1B","1B","-","-","Skin corrosion – category 1B\nAcute toxicity – category 4",null,"URT, eye & skin irr","1B"]
[null,null,490,"Phosphorus (yellow)","7723-14-0",null,0.1,null,null,null,null,null,"1B","1B","1B","-","-","-",null,"LRT, URT & GI irr; liver damage",4]
[null,null,491,"Phosphorus oxychloride (Phosphoryl trichloride)","10025-87-3",0.1,0.63,null,null,null,null,null,"1B",4,"1B","-","-","Acute toxicity – category 2\nSTOT (repeated exposure) – category 1\nAcute toxicity – category 4\nSkin corrosion – category 1A","Should be Cat 4 given GHS STOT hazard category and irritant properties.  ACGIH documentation notes both acute and repeated chronic effects.","URT irr",4,"Y"]
[null,null,492,"Phosphorus pentachloride","10026-13-8",0.1,0.85,null,null,null,null,null,"1B","1B","1B","-","-","Acute toxicity – category 2\nAcute toxicity – category 4\nSTOT (repeated exposure) – category 2\nSkin corrosion – category 1B","Possibly a Cat 4 given GHS STOT hazard category or Cat 2 on irritant properties; ACGIH documentation notes only irritant effects.\nCat 2 is an irritant, by GHS cat 1 => cat 2","URT & eye irr",2,"M"]
[null,null,493,"Phosphorus pentasulphide (Diphosphorous pentasulphide)","1314-80-3",null,1,null,null,3,null,null,"1B","1B","1B","-","-","Acute toxicity – category 4",null,"URT irr","1B"]
[null,null,494,"Phosphorus trichloride","7719-12-2",0.2,1.1000000000000001,null,0.5,2.8,null,null,"1B","1B","1B","-","-","Acute toxicity – category 2\nSTOT (repeated exposure) – category 2\nSkin corrosion – category 1A","Possibly a Cat 4 given GHS STOT hazard category or Cat 2 on irritant properties; ACGIH documentation notes only irritant effects.\nCat 2 is an irritant, by GHS cat 1 => cat 2","URT, eye & skin irr","1B","M"]
[null,null,495,"Phthalic anhydride","85-44-9",1,6.1,null,null,null,null,null,3,4,"3","-","Sen","Acute toxicity – category 4\nSTOT (single exposure) – category 3\nSkin irritation – category 2\nEye damage – category 1\nSkin sensitisation – category 1\nRespiratory sensitisation – category 1","Should be Cat 4 based on GHS categories for sensitisation and acute eye damage, plus ACGIH irritation.","URT, eye & skin irr",4,"Y"]
[null,null,496,"m-Phthalodinitrile","626-17-5",null,5,null,null,null,null,null,"1C","1C","1C","-","-","-",null,"Eye & URT irr","1B"]
[null,null,497,"Picloram (Tordon)","1918-02-1",null,10,null,null,null,null,null,"1C","1C","1C","-","-","-",null,"Liver & kidney changes - modest, in rats & mice",3]
[null,null,498,"Picric acid (2,4,6-Trinitrophenol)","88-89-1",null,0.1,null,null,null,null,null,3,3,"3","-","-","Acute toxicity – category 3",null,"Skin sensitisation; dermatitis; eye irr",3]
[null,null,499,"Pindone (Pival; 2-Pivalyl-1,3-indandione)","83-26-1",null,0.1,null,null,null,null,null,3,3,"3","-","-","Acute toxicity – category 3\nSTOT (repeated exposure) – category 1",null,"Coagulation",4]
[null,null,500,"Piperazine dihydrochloride","142-64-3",null,5,null,null,null,null,null,3,4,"3","-","Sen","Eye irritation – category 2A\nSkin irritation – category 2\nSTOT (single exposure) – category 1\nSTOT (repeated exposure) – category 2\nRespiratory sensitisation – category 1\nSkin sensitisation – category 1\nReproductive toxicity – category 2","Cat 4 based on acute as well as chronic effects.","Respiratory sensitiser; asthma",4,"Y"]
[null,null,501,"Piperidine","110-89-4",1,3.5,null,null,null,null,null,"1B","1B",null,"-","Sk","Acute toxicity – category 3\nAcute toxicity – category 4\nSkin corrosion – category 1A","UK HSE documentation - eye & URT irr","No data"]
[null,null,502,"Platinum, metal","7440-06-4",null,1,null,null,null,null,null,3,3,"3","-","-","-",null,"Asthma; URT irr",4]
[null,null,503,"Platinum, soluble salts (as Pt)",null,null,2E-3,null,null,null,null,null,3,3,"3","-","Sen","Respiratory sensitisation – category 1\nSkin sensitisation – category 1",null,"Asthma; URT irr",4]
[null,null,504,"Portland cement ","65997-15-1",null,10,null,null,null,null,null,"1B","1B","1B","-","- ","-",null,"Pulmonary function; respiratory symptoms; asthma","1C"]
[null,null,505,"Potassium hydroxide","1310-58-3",null,null,null,null,null,null,2,"1A","1A","1A","-","- ","Acute toxicity – category 4\nSkin corrosion – category 1A",null,"URT, eye & skin irr","1B"]
[null,null,506,"Potassium Persulfate","7727-21-1",null,null,null,null,null,null,0.01,2,2,null,"-","Sen","Acute toxicity – category 4\nSkin irritation – category 2\nEye irritation – category 2A\nRespiratory sensitisation – category 1\nSkin sensitisation – category 1\nSTOT (single exposure) – category 3","NIOSH Int Chem Safety Card - URT irr,  sore throat, wheezing","Skin irr","1B"]
[null,null,507,"Precipitated silica ","112926-00-8",null,10,null,null,null,null,null,"1C","1C","1C","-","- ","-"]
[null,null,508,"Propane-1,2-diol total: (vapour & particulates)","57-55-6",150,474,null,null,null,null,null,2,2,null,"-","-","-","UK HSE documentation - nasal & eye irr; NIOSH Int Chem Safety Card - eye irr; skin sensitisation","No data"]
[null,null,509,"Propane-1,2-diol: particulates only","57-55-6",null,10,null,null,null,null,null,2,2,null,"-","- ","-","UK HSE documentation - nasal & eye irr; NIOSH Int Chem Safety Card - eye irr; skin sensitisation","No data"]
[null,null,510,"Propargyl alcohol (Prop-2-yn-1-ol)","107-19-7",1,2.2999999999999998,null,null,null,null,null,"1B","1B","1B","-","Sk ","Acute toxicity – category 3\nSkin corrosion – category 1B",null,"Eye irr; liver & kidney damage",4]
[null,null,511,"beta-Propiolactone","57-57-8",0.5,1.5,null,null,null,null,null,4,4,"3","Carc. 1B","-","Acute toxicity – category 3\nAcute toxicity – category 1\nCarcinogenicity – category 1B\nGerm cell mutagenicity – category 1B\nEye irritation – category 2A\nSkin irritation – category 2\nSkin sensitisation – category 1",null,"Skin cancer; URT irr",4]
[null,null,512,"Propionic acid","79-09-4",10,30,null,null,null,null,null,"1B",2,"1B","-","-","Acute toxicity – category 3\nAcute toxicity – category 4\nSkin corrosion – category 1B\nSTOT(single exposure) – category 3","Should be a Cat 2 given GHS STOT and skin hazard categories.","Eye, skin & URT irr","1B","Y"]
[null,null,513,"Propoxur (PHC, Baygon, Arprocarb)","114-26-1",null,0.5,null,null,null,null,null,4,4,"4","-","-","Acute toxicity – category 3",null,"Cholinesterase inhibition",4]
[null,null,514,"Propranolol","525-66-6",0.188,2,null,0.56499999999999995,6,null,null,2,2,null,"-","-","-","UK HSE documentation - bronchoconstriction in asthmatics","No data"]
[null,null,515,"n-Propyl acetate","109-60-4",200,835,null,250,1040,null,null,"1B","1B","1B","-","-","STOT (single exposure) – category 3\nEye irritation – category 2A","Is an irritant. Does have acute effects & chronic effects, but at warning level only.","Eye & URT irr","1B"]
[null,null,516,"Propyl alcohol (Propan-1-ol)","71-23-8",200,492,null,250,614,null,null,"1B",2,"1B","-","Sk","STOT (single exposure) – category 3\nEye damage – category 1","Sparse documentation, lower level chronic, eye damage Cat 1.  Should be Cat 2 based on ACGIH documentation which based TLV on structure-activity relationship to 2-propanol.","URT & eye irr",2,"Y"]
[null,null,517,"n-Propyl nitrate","627-13-4",25,107,null,40,172,null,null,2,2,"2","-","-","-",null,"Nausea; headache",4]
[null,null,518,"Propylene dichloride (1,2-Dichloropropane)","78-87-5",75,347,null,110,508,null,null,4,4,"4","-","-","Carcinogenicity – category 1B\nAcute toxicity – category 4",null,"URT irr; body weight effect; DSEN notation",4]
[null,null,519,"Propylene glycol dinitrate","6423-43-4",0.05,0.34,null,null,null,null,null,4,4,"4","-","Sk","-",null,"Headache; CNS impairment",2]
[null,null,520,"Propylene glycol monomethyl ether (1-Methoxypropan-2-ol)","107-98-2",100,369,null,150,553,null,null,4,4,"4","-","-","STOT (single exposure) – category 3",null,null,"1B"]
[null,null,521,"Propylene imine (2-methylaziridine)","75-55-8",2,4.7,null,null,null,null,null,3,4,"3","Carc. 1B","Sk","Acute toxicity – category 2\nAcute toxicity – category 1\nCarcinogenicity – category 1B\nGerm cell mutagenicity – category 1B\nSkin corrosion – category 1C","Cat 4 based on acute as well as chronic effects.","URT irr; kidney damage; skin notation",3,"Y"]
[null,null,522,"Propylene oxide (1,2-Epoxypropane; Oxirane, methyl-)","75-56-9",20,48,null,null,null,null,null,4,4,"3","Carc. 1B","-","Acute toxicity – category 4\nGerm cell mutagenicity – category 1B\nSTOT (single exposure) – category 3\nSkin corrosion – category 1B\nCarcinogenicity – category 1B",null,"Eye & URT irr",4]
[null,null,523,"Pyrethrum (Pyrethrins (ISO))","8003-34-7?",null,5,null,null,null,null,null,3,3,"3","-","Sen","Acute toxicity – category 4",null,"Liver damage; LRT irr",3]
[null,null,524,"Pyridine","110-86-1",5,16,null,null,null,null,null,3,3,"3","-","- ","Acute toxicity – category 4\nSkin corrosion – category 1C\nSTOT (repeated exposure) – category 2",null,"Skin irr; liver & kidney damage",4]
[null,null,525,"Quartz (respirable dust)","14808-60-7",null,0.1,null,null,null,null,null,3,3,"3","-","- ","Carcinogenicity – category 1A\nSTOT (repeated exposure) – category 1",null,"Pulm fibrosis; lung cancer",3]
[null,null,526,"Quinone (p-Benzoquinone)","106-51-4",0.1,0.44,null,null,null,null,null,"1B","1B","1B","-","- ","Acute toxicity – category 3\nEye irritation – category 2\nSTOT (single exposure) – category 3\nSkin irritation – category 2","Possibly a Cat 2 given GHS STOT hazard category, but primarily an irritant.","Eye irritation; skin damage","1B"]
[null,null,527,"Resorcinol (m-Dihydroxybenzene)","108-46-3",10,45,null,20,90,null,null,2,2,"2","-","- ","Acute toxicity – category 4\nSkin irritation – category 2\nEye irritation – category 2A\nSkin sensitisation – category 1",null,"Eye & skin irr",4]
[null,null,528,"Rhodium, insoluble compounds (as Rh)","7440-16-6",null,1,null,null,null,null,null,"1B","1B","3","-","- ","-",null,"LRT irr",4]
[null,null,529,"Rhodium, metal","7440-16-6",null,1,null,null,null,null,null,"1B","1B","3","-","- ","-",null,"URT irr",4]
[null,null,530,"Rhodium, soluble compounds (as Rh)","7440-16-6",null,0.01,null,null,null,null,null,3,3,"3","-","- ","-",null,"Asthma",4]
[null,null,531,"Ronnel (Fenchlorphos)","299-84-3",null,10,null,null,null,null,null,4,4,"4","-","- ","Acute toxicity – category 4",null,"Cholinesterase inhib",3]
[null,null,532,"Rosin core solder pyrolysis products (as formaldehyde)",null,null,0.1,null,null,null,null,null,3,3,"3","-","- ","Skin sensitisation – category 1",null,"Skin sensitisation; dermatitis; asthma","1C"]
[null,null,533,"Rotenone (commercial)","83-79-4",null,5,null,null,null,null,null,4,2,"4","-","- ","Acute toxicity – category 3\nEye irritation – category 2\nSTOT (single exposure) – category 3\nSkin irritation – category 2","Only acute effects are indicated by GHS hazard classifications and TLV is set to protect against irritation, rhinitis and dermatitis.","URT & eye irr; CNS impairment",4,"Y"]
[null,null,534,"Rouge dust ",null,null,10,null,null,null,null,null,"1C","1C","1C","-","- ","-",null,null,"1C"]
[null,null,535,"Selenium compounds (as Se) excluding hydrogen selenide","7782-49-2",null,0.1,null,null,null,null,null,4,4,"4","-","- ","Acute toxicity – category 3\nSTOT (repeated exposure) – category 2",null,"Eye & URT irr",4]
[null,null,536,"Selenium hexafluoride (as Se)","7783-79-1",0.05,0.16,null,null,null,null,null,4,4,"4","-","- ","-",null,"Pulmonary oedema",4]
[null,null,537,"Sesone (2,4-DES sodium; Crag Herbicide; Sodium 2,4-dichloro phenoxyethyl sulfate)","136-78-7",null,10,null,null,null,null,null,3,3,"3","-","- ","-",null,"GI irr","1C"]
[null,null,538,"Silica – Amorphous - Fume (thermally generated)(respirable dust)",null,null,2,null,null,null,null,null,3,3,"3","-","- ","-",null,null,2]
[null,null,539,"Silica – Crystalline (respirable dust)","7631-86-9",null,0.1,null,null,null,null,null,3,3,"3","-","-","Carcinogenicity – category 1A\nSTOT (repeated exposure) – category 1",null,"Pulm fibrosis; lung cancer",3]
[null,null,540,"Silica gel ","112926-00-8",null,10,null,null,null,null,null,"1C","1C","1C","-","- ","-",null,null,"1C"]
[null,null,541,"Silica, fused","60676-86-0",null,0.1,null,null,null,null,null,3,3,"3","-","- ","-",null,null,3]
[null,null,542,"Silicon ","7440-21-3",null,10,null,null,null,null,null,"1C","1C","1C","-","- ","-",null,null,"1C"]
[null,null,543,"Silicon carbide ","409-21-2",null,10,null,null,null,null,null,"1C","1C","1C","-","- ","-",null,null,"1C"]
[null,null,544,"Silicon tetrahydride (Silane)","7803-62-5",5,6.6,null,null,null,null,null,2,2,"2","-","- ","-",null,"URT irr",4]
[null,null,545,"Silver, metal","7440-22-4",null,0.1,null,null,null,null,null,3,3,"3","-","- ","-",null,null,3]
[null,null,546,"Silver, soluble compounds (as Ag)","7440-22-4",null,0.01,null,null,null,null,null,3,3,"3","-","- ","-",null,null,3]
[null,null,547,"Soapstone ","14378-12-2",null,6,null,null,null,null,null,3,3,"3","-","- ","-",null,null,3]
[null,null,548,"Soapstone (respirable dust)","14378-12-2",null,3,null,null,null,null,null,3,3,"3","-","- ","-",null,null,3]
[null,null,549,"Sodium azide ","26628-22-8",null,null,null,null,null,0.11,0.3,"1A","1A","1A","-","- ","Acute toxicity – category 2",null,"Cardiac impair; lung damage","1A"]
[null,null,550,"Sodium bisulphite (Sodium hydrogen sulphite)","7631-90-5",null,5,null,null,null,null,null,"1B","1B","1B","-","- ","Acute toxicity – category 4\nEye damage – category 1",null,"Skin, eye & URT irr","1B"]
[null,null,551,"Sodium fluoroacetate","62-74-8",null,0.05,null,null,0.15,null,null,2,2,"2","-","Sk ","Acute toxicity – category 1\nAcute toxicity – category 2",null,"CNS impairment; cardiac impairment; nausea",2]
[null,null,552,"Sodium hydroxide","1310-73-2",null,null,null,null,null,null,2,"1A","1A","1A","-","- ","STOT (single exposure) – category 3\nSkin corrosion – category 1A","Could be changed to Cat 2 based on GHS STOT hazard category, but there is no TWA WES.  It is an irritant with only a peak / ceiling value, hence remains Cat 1A.","URT, eye & skin irr","1A","M"]
[null,null,553,"Sodium metabisulphite (Disodium disulphite)","7681-57-4",null,5,null,null,null,null,null,"1B","1B","1B","-","- ","Acute toxicity – category 4\nEye damage – category 1",null,"URT irr","1B"]
[null,null,554,"Sodium persulfate","7775-27-1",null,null,null,null,null,null,0.01,2,"1A",null,"-","Sen","Acute toxicity – category 4\nSkin irritation – category 2\nEye irritation – category 2A\nRespiratory sensitisation – category 1\nSkin sensitisation – category 1\nSTOT (single exposure) – category 3","NIOSH Int Chem Safety Card - URT irr, sore throat, wheezing.  Could be Cat 2 based on GHS acute effects, but there is no TWA WES.  It is an irritant with only a peak / ceiling value, hence must be classified as Cat 1A.","Skin irr","1B","Y"]
[null,null,555,"Starch ","9005-25-8",null,10,null,null,null,null,null,3,3,"3","-","- ","-",null,"Dermatitis","1C"]
[null,null,556,"Stearates ",null,null,10,null,null,null,null,null,"1C","1C","1C","-","- ","-",null,null,"1C"]
[null,null,557,"Stibine (Antimony hydride)","7803-52-3",0.1,0.51,null,null,null,null,null,4,4,"4","-","- ","-",null,"Haemolysis; kidney damage; LRT irr",2]
[null,null,558,"Strychnine","57-24-9",null,0.15,null,null,null,null,null,2,2,"2","-","- ","Acute toxicity – category 1\nAcute toxicity – category 2",null,"CNS impairment",2]
[null,null,559,"Styrene, monomer (Phenylethylene, Vinyl benzene)","100-42-5",50,213,null,100,426,null,null,4,4,"4","-","- ","Reproductive toxicity – category 2\nAcute toxicity – category 4\nSTOT (repeated exposure) – category 1\nSkin irritation – category 2\nEye irritation – category 2 ",null,"CNS impairment; URT irr; peripheral neuropothy",2]
[null,null,560,"Subtilisins (Proteolytic enzymes as 100% pure crystalline enzyme)","1395-21-7",null,null,null,null,null,null,6.0000000000000002E-5,4,"1A","1C","-","Sen ","-","Considering strong irritant effects and there is no TWA WES, only a peak / ceiling value, must be classified as Cat 1A.","Skin, URT & LRT irr; asthma","1A","Y"]
[null,null,561,"Sucrose ","57-50-1",null,10,null,null,null,null,null,"1C","1C","1C","-","- ","-",null,null,"1C"]
[null,null,562,"Sulfotep (TEDP; O,O,O,O-Tetraethyl dithiopyrophosphate)","3689-24-5",7.0000000000000001E-3,0.1,null,null,null,null,null,4,4,"4","-","Sk ","Acute toxicity – category 1\nAcute toxicity – category 2",null,null,4]
[null,null,563,"Sulphur dioxide","7446-09-5",2,5.2,null,5,13,null,null,"1B","1B","1B","-","- ","Acute toxicity – category 3\nSkin corrosion – category 1B",null,"Pulmonary function; LRT irr","1B"]
[null,null,564,"Sulphur hexafluoride","2551-62-4",1000,5970,null,null,null,null,null,"1C","1C","1C","-","- ","-",null,"Asphyxia","1C"]
[null,null,565,"Sulphur monochloride (Disulphur dichloride)","10025-67-9",null,null,null,null,null,1,5.5,"1A","1A","1A","-","- ","Acute toxicity – category 3\nAcute toxicity – category 4\nSkin corrosion – category 1A",null,"URT, eye & skin irr","1A"]
[null,null,566,"Sulphur pentafluoride (Disulphur decafluoride)","5714-22-7",null,null,null,null,null,0.01,0.1,"1A","1A","1A","-","- ","-",null,"URT irr; lung damage","1A"]
[null,null,567,"Sulphur tetrafluoride","7783-60-0",null,null,null,null,null,0.1,0.44,"1A","1A","1A","-","- ","-",null,"Eye & URT irr; lung damage",2]
[null,null,568,"Sulphuric acid","7664-93-9",null,1,null,null,3,null,null,"1B",4,"1B","-","- ","Skin corrosion – category 1A","Cat 4 due to long-term effect (cancer) plus lung effects.","Pulmonary function; A2 carcinogen","1B","Y"]
[null,null,569,"Sulphuryl fluoride","2699-79-8",5,21,null,10,42,null,null,3,3,"3","-","- ","Acute toxicity – category 3\nSTOT (repeated exposure) – category 2",null,"CNS impairment",2]
[null,null,570,"Sulprofos (Bolstar)","35400-43-2",null,1,null,null,null,null,null,4,4,"4","-","- ","-",null,"Cholinesterase inhibition",4]
[null,null,571,"2,4,5-T (2,4,5-Trichlorophenoxyacetic acid)","93-76-5",null,10,null,null,null,null,null,"1C","1C","1C","-","-","Acute toxicity – category 4\nEye irritation – category 2\nSTOT (single exposure) – category 3\nSkin irritation – category 2","Possibly a Cat 2 given GHS STOT hazard category.","PNS impairment","1C","M"]
[null,null,572,"Talc (containing no asbestos fibres)","14807-96-6",null,2.5,null,null,null,null,null,3,3,"3","-","-","-",null,"Pulm fibrosis; pulm function",3]
[null,null,573,"Tantalum, metal & oxide dusts","7440-25-7",null,5,null,null,null,null,null,"1C","1C","1C","-","- ","-",null,null,4]
[null,null,574,"Tellurium & compounds (as Te)","13494-80-9",null,0.1,null,null,null,null,null,4,4,"4","-","- ","-",null,"Haliotosis",4]
[null,null,575,"Tellurium hexafluoride (as Te)","7783-80-4",0.02,0.1,null,null,null,null,null,2,2,"2","-","- ","-",null,"LRT irr",2]
[null,null,576,"Temephos (Abate)","3383-96-8",null,10,null,null,null,null,null,4,4,"4","-","- ","-",null,"Cholinesterase inhibition","1C"]
[null,null,577,"TEPP (Tetraethyl pyrophosphate)","107-49-3",4.0000000000000001E-3,4.7E-2,null,null,null,null,null,4,4,"4","-","Sk ","Acute toxicity – category 1\nAcute toxicity – category 2",null,"Cholinesterase inhibition",4]
[null,null,578,"Terphenyls","26140-60-3",null,null,null,null,null,0.5,4.7,"1A","1A","1A","-","- ","-",null,"URT & eye irr; (potential sensitisation but not confirmed)","1A"]
[null,null,579,"1,1,2,2-Tetrabromoethane (Acetylene tetrabromide)","79-27-6",1,14,null,null,null,null,null,4,4,"4","-","- ","Acute toxicity – category 2\nEye irritation – category 2",null,"Eye & URT irr; pulmonary oedema; liver damage",2]
[null,null,580,"1,1,2,2-Tetrachloro-1,2-difluoroethane","76-12-0",500,4170,null,null,null,null,null,4,4,"4","-","- ","-",null,null,4]
[null,null,581,"1,1,1,2-Tetrachloro-2,2-difluoroethane","76-11-9",500,4170,null,null,null,null,null,4,4,"4","-","- ","-",null,null,4]
[null,null,582,"1,1,2,2-Tetrachloroethane","79-34-5",1,6.9,null,null,null,null,null,4,4,"4","-","Sk ","Acute toxicity – category 1\nAcute toxicity – category 2",null,null,4]
[null,null,583,"Tetrachloronaphthalene","1335-88-2",null,2,null,null,null,null,null,3,3,"3","-","- ",null,null,null,3]
[null,null,584,"Tetraethyl lead (as Pb)","78-00-2",null,0.1,null,null,null,null,null,2,4,"3","-","Sk ","Acute toxicity – category 1\nCarcinogenicity – category 2\nReproductive toxicity – category 1A\nSTOT (repeated exposure) – category 1","Has chronic as well as acute, seems to be clearly a 4. ","CNS impairment; skin notation",4,"Y"]
[null,null,585,"1,1,1,2-Tetrafluoroethane (HFC 134a)","811-97-2",1000,4240,null,null,null,null,null,"1C","1C",null,"-","- ","-","UK HSE documentation - nose & eye irr - low","No data"]
[null,null,586,"Tetrahydrofuran","109-99-9",100,295,null,null,null,null,null,4,4,"1B","-","Sk ","Skin irritation – category 2\nEye irritation – category 2A\nCarcinogenicity – category 2\nSTOT (single exposure) – category 3","Specific organ toxicity, animal cancer - all warning level, leave at 4, but not clearcut.  ACGIH has a STEL also.","URT irr; CNS impairment; kidney damage",3]
[null,null,587,"Tetramethyl lead (as Pb)","75-74-1",null,0.15,null,null,null,null,null,3,4,"3","-","Sk ","Acute toxicity – category 1\nCarcinogenicity – category 2\nReproductive toxicity – category 1A\nSTOT (repeated exposure) – category 1","Has chronic effects plus acute oral toxicity is highest level (fatal) => Adj category 4","CNS impairment; skin notation",4,"Y"]
[null,null,588,"Tetramethyl succinonitrile","3333-52-6",0.5,2.8,null,null,null,null,null,2,2,"2","-","Sk ","-",null,"Headache; nausea; CNS convulsions",4]
[null,null,589,"Tetranitromethane ","509-14-8",1,8,null,null,null,null,null,4,4,"4","-","- ","-",null,"Eye & URT irr; URT cancer",3]
[null,null,590,"Tetrasodium pyrophosphate","7722-88-5",null,5,null,null,null,null,null,"1B","1B","1B","-","- ","-",null,null,"1B"]
[null,null,591,"Tetryl (2,4,6-Trinitrophenylmethylnitramine; N-Methyl-N-2,4,6-tetranitroaniline)","479-45-8",null,1.5,null,null,null,null,null,3,3,"3","-","Sen ","Acute toxicity – category 3\nSTOT (repeated exposure) – category 2",null,null,3]
[null,null,592,"Thallium, soluble compounds (as Tl)","7440-28-0",null,0.1,null,null,null,null,null,3,3,"3","-","Sk ","Acute toxicity – category 2\nSTOT (repeated exposure) – category 2",null,"GI damage; peripheral neuropathy",4]
[null,null,593,"4,4'-Thiobis (6-tert-butyl-m-cresol)","96-69-5",null,10,null,null,null,null,null,"1C","1C","1C","-","- ","-",null,null,"1C"]
[null,null,594,"Thioglycolic acid (Mercaptoacetic acid)","68-11-1",1,3.8,null,null,null,null,null,"1B",2,"1B","-","Sk ","Acute toxicity – category 3\nAcute toxicity – category 4\nAcute toxicity – category 2\nSkin corrosion – category 1\nSkin sensitisation – category 1\nSTOT (repeated exposure) – category 2","Toxic if swallowed, chronic effects at warning level => Adjmt cat 2","Eye & skin irr; skin notation","1B","Y"]
[null,null,595,"Thionyl chloride (thionyl dichloride)","7719-09-7",null,null,null,null,null,1,4.9000000000000004,"1A","1A","1A","-","- ","Acute toxicity – category 4\nSkin corrosion – category 1A",null,"URT irr; (analogous to HCl)","1A"]
[null,null,596,"Thiram (Tetramethyl thiuram disulphide)","137-26-8",null,1,null,null,null,null,null,3,3,"3","-","Sen","Acute toxicity – category 4\nSkin irritation – category 2\nEye irritation – category 2A\nSkin sensitisation – category 1\nGerm cell mutagenicity – category 2\nSTOT (repeated exposure) – category 2",null,"Body weight & haematological effect",4]
[null,null,597,"Tin, metal","7440-31-5",null,2,null,null,null,null,null,3,3,"3","-","-","-",null,"Pneumoconiosis",3]
[null,null,598,"Tin, organic compounds (as Sn)","7440-31-5",null,0.1,null,null,0.2,null,null,3,3,"3","-","Sk: see Notes","Acute toxicity – category 2\nAcute toxicity – category 3\nAcute toxicity – category 4\nSTOT (repeated exposure) – category 1\nEye irritation – category 2\nSkin irritation – category 2 ",null,"Eye & URT irr; headache; nausea; CNS & immune effects",4]
[null,null,599,"Tin, oxide & inorganic compounds, except SnH4 (as Sn)","7440-31-5",null,2,null,null,null,null,null,3,3,"3","-","-","-",null,null,3]
[null,null,600,"Titanium dioxide ","13463-67-7",null,10,null,null,null,null,null,"1C","1C","1C","-","- ","-",null,null,"1C"]
[null,null,601,"Toluene ","108-88-3",50,191,null,150,574,null,null,4,4,"4","-","Sk ","Skin irritation – category 2\nSTOT (repeated exposure) – category 2\nReproductive toxicity – category 1A",null,"Visual impairment; female repro; pregnancy loss",2]
[null,null,602,"Toluene-2,4-diisocyanate (TDI; 4-methyl-m-phenylene diisocyanate)","584-84-9",null,0.02,null,null,7.0000000000000007E-2,null,null,3,4,"3","Carc. 2","Sen","Carcinogenicity – category 2\nAcute toxicity – category 1\nEye irritation – category 2A\nSTOT (single exposure) – category 3\nRespiratory sensitisation – category 1\nSkin sensitisation – category 1\nSkin irritation – category 2","GHS Cat 1 resp sensitiser and Cat 1 inhalation. Adjmt category Cat 4 appropriate.","Respiratory sensitiser",4,"Y"]
[null,null,603,"m-Toluidine","108-44-1",2,8.8000000000000007,null,null,null,null,null,2,4,"2","-","Sk","Acute toxicity – category 3\nSTOT (repeated exposure) – category 2","Has both acute and chronic effects.","Eye, bladder & kidney irr; MeHb-emia",4,"Y"]
[null,null,604,"o-Toluidine","95-53-4",2,8.8000000000000007,null,null,null,null,null,4,4,"4","Carc. 1B","Sk","STOT (single exposure) – category 1\nCarcinogenicity – category 1A\nGerm cell mutagenicity – category 1B\nEye irritation – category 2A\nSTOT (repeated exposure) – category 2",null,null,4]
[null,null,605,"p-Toluidine","106-49-0",2,8.8000000000000007,null,null,null,null,null,4,4,"4","Carc. 2","Sk","Acute toxicity – category 3\nCarcinogenicity – category 2\nEye irritation – category 2A\nSkin sensitisation – category 1",null,"MeHb-emia",4]
[null,null,606,"Tributyl phosphate (Phosphoric acid, tributyl ester)","126-73-8",0.2,2.2000000000000002,null,null,null,null,null,4,4,"1B","Carc. 2","-","Acute toxicity – category 4\nAcute toxicity – category 3\nCarcinogenicity – category 2\nSkin irritation – category 2",null,"Bladder, eye & URT irr",4]
[null,null,607,"1,1,2-Trichloro-1,2,2-trifluoroethane (Fluorocarbon 113, Freon 113)","76-13-1",1000,7670,null,1250,9590,null,null,2,2,"2","-","-","-",null,"CNS impairment",4]
[null,null,608,"Trichloroacetic acid (TCA)","76-03-9",1,6.7,null,null,null,null,null,"1B",2,"1B","-","-","Skin corrosion – category 1A","Should be a Cat 2 due to GHS skin category 1.","Eye & URT irr","1B","Y"]
[null,null,609,"1,2,4-Trichlorobenzene","120-82-1",null,null,null,null,null,5,37,"1A","1A","1B","-","-","Acute toxicity – category 4\nSkin irritation – category 2",null,"Eye & URT irr; ceiling value assigned","1A"]
[null,null,610,"1,1,1-Trichloroethane (Methyl chloroform)","71-55-6",100,555,null,200,1110,null,null,2,2,"2","-","-","Acute toxicity – category 4",null,"CNS impairment; liver damage",4]
[null,null,611,"1,1,2-Trichloroethane","79-00-5",10,55,null,null,null,null,null,4,4,"4","Carc. 2","Sk","Carcinogenicity – category 2\nAcute toxicity – category 4",null,"CNS impairment; liver damage; A3 carcinogen",4]
[null,null,612,"Trichloroethylene (Ethene, trichloro)","79-01-6",10,54,null,40,216,null,null,4,4,"2","Carc. 1B","Sk","Carcinogenicity – category 1B\nGerm cell mutagenicity – category 2\nEye irritation – category 2A\nSkin irritation – category 2\nSTOT (single exposure) – category 3",null,"CNS impairment; cognitive decrements; renal toxicity",4]
[null,null,613,"Trichlorofluoromethane (Fluorocarbon 11, Freon 11, Fluorotrichloromethane)","75-69-4",null,null,null,null,null,1000,5620,"1A","1A","1A","-","-","-",null,"Cardiac sensitisation","1A"]
[null,null,614,"Trichloronaphthalene","1321-65-9",null,5,null,null,null,null,null,3,3,"3","-","Sk","-",null,"Liver damage; chlorachne",4]
[null,null,615,"1,2,3-Trichloropropane","96-18-4",10,60,null,null,null,null,null,4,4,"3","Carc. 1B","Sk","Acute toxicity – category 3\nCarcinogenicity – category 1B\nEye irritation – category 2A\nSTOT (single exposure) – category 3\nSTOT (repeated exposure) – category 2\nReproductive toxicity – category 1B",null,"Cancer; liver & kidney damage; eye & URT irr",4]
[null,null,616,"Tridymite (respirable dust)","15468-32-3",null,0.1,null,null,null,null,null,3,3,"3","-","- ","-",null,null,3]
[null,null,617,"Triethanolamine (Ethanol, 2,2',2''-nitrilotris-)","102-71-6",null,5,null,null,null,null,null,3,2,"3","-","Sen ","Eye irritation – category 2A\nSkin irritation – category 2\nSTOT (single exposure) – category 3","Is an irritant and a strong base. Is some reference (ACGIH) to contact dermititis, so could also keep at Cat 3.","Eye & skin irr",4,"Y"]
[null,null,618,"Triethylamine (N,N-Diethylethanamine)","121-44-8",2,8,null,4,17,null,null,4,4,"4","-","- ","Acute toxicity – category 4\nAcute toxicity – category 3\nSTOT (single exposure) – category 3\nSkin corrosion – category 1A",null,"Visual impairment; URT irr; skin notation",4]
[null,null,619,"Trifluorobromomethane (Fluorocarbon 13B1, Bromotrifluoromethane)","75-63-8",1000,6090,null,null,null,null,null,"1C","1C","1C","-","- ","-",null,null,"1C"]
[null,null,620,"Triglycidylisocyanurate (TGIC; Araldite PT 810)","2451-62-9",null,0.08,null,null,null,null,null,3,3,"3","-","Sen ","-"]
[null,null,621,"Trimellitic anhydride (Benzene-1,2,4-tricarboxylic acid-1,2-anhydride)","552-30-7",5.0000000000000001E-3,3.9E-2,null,null,null,null,null,3,3,"3","-","Sen ","STOT (single exposure) – category 3\nEye damage – category 1\nRespiratory sensitisation – category 1\nSkin sensitisation – category 1",null,"Respiratory sensitiser","1A"]
[null,null,622,"Trimethyl benzene","25551-13-7",25,123,null,null,null,null,null,3,3,"3","-","- ","-",null,"CNS impairment; asthma; haematological effects",4]
[null,null,623,"Trimethyl phosphite (Phosphorous acid, trimethyl ester)","121-45-9",2,10,null,null,null,null,null,"1B","1B","1B","-","- ","Acute toxicity – category 4\nSTOT (repeated exposure) – category 2","Possibly a Cat 3 given GHS STOT hazard category.",null,"1B","M"]
[null,null,624,"Trimethylamine ","75-50-3",10,24,null,15,36,null,null,"1B",2,"1B","-","- ","Acute toxicity – category 4\nSTOT (single exposure) – category 3\nEye damage – category 1\nSkin irritation – category 2","Should be a Cat 2 given GHS STOT, eye and skin hazard categories.","URT, eye & skin irr","1B","Y"]
[null,null,625,"2,4,6-Trinitrotoluene (TNT)","118-96-7",null,0.5,null,null,null,null,null,3,3,"3","-","Sk ","Acute toxicity – category 3\nSTOT (repeated exposure) – category 2",null,"MeHb-emia; liver damage; cataracts",4]
[null,null,626,"Triorthocresyl phosphate (Tri o-tolylphosphate)","78-30-8",null,0.1,null,null,null,null,null,4,4,"3","-","Sk ","STOT (single exposure) – category 1",null,"Neurotoxicity; cholinesterase inhib; skin notation",4]
[null,null,627,"Triphenyl amine","603-34-9",null,5,null,null,null,null,null,"1C","1C","1C","-","- ","-",null,null,4]
[null,null,628,"Triphenyl phosphate","115-86-6",null,3,null,null,null,null,null,4,4,"4","-","- ","-",null,"Cholinesterase inhib",4]
[null,null,629,"Tripoli (Microcrystalline Silica)","1317-95-9",null,0.1,null,null,null,null,null,3,3,"3","-","- ","Carcinogenicity – category 1A\nSTOT (repeated exposure) – category 1",null,null,3]
[null,null,630,"Tungsten, insoluble compounds (as W)","7440-33-7",null,5,null,null,10,null,null,"1C","1C","1C","-","- ","-",null,"LRT irr","1C"]
[null,null,631,"Tungsten, soluble compounds (as W)","7440-33-7",null,1,null,null,3,null,null,2,2,"2","-","- ","-",null,"CNS impairment; pulmonary fibrosis",4]
[null,null,632,"Turpentine (wood)","8006-64-2",100,557,null,null,null,null,null,4,4,"1B","-","Sen ","Acute toxicity – category 4\nEye irritation – category 2\nSkin irritation – category 2\nSkin sensitisation – category 1",null,"URT & skin irr; CNS impair; lung damage",2]
[null,null,633,"Uranium (natural), soluble & insoluble compounds (as H)","7440-61-1",null,0.2,null,null,0.6,null,null,3,3,"3","-","- ","Acute toxicity – category 2\nSTOT (repeated exposure) – category 2",null,"Kidney damage",3]
[null,null,634,"n-Valeraldehyde","110-62-3",50,176,null,null,null,null,null,"1B","1B","1B","-","- ","-",null,"Eye, skin & URT irr","1B"]
[null,null,635,"Vanadium (as V2O5) (divanadium pentaoxide), (respirable dust & fume)","1314-62-1",null,0.05,null,null,null,null,null,"1B",4,"1B","-","- ","Acute toxicity – category 4\nEye damage – category 1\nGerm cell mutagenicity – category 2\nCarcinogenicity – category 2\nReproductive toxicity – category 2\nSTOT (single exposure) – category 3\nSTOT (repeated exposure) – category 1","Has chronic as well as acute, seems to be clearly a 4. ","URT & LRT irr",4,"Y"]
[null,null,636,"Vegetable oil mists (except castor oil, cashew nut or similar irritant oils)",null,null,10,null,null,null,null,null,"1C","1C","1C","-","- ","-",null,null,"1C"]
[null,null,637,"Vinyl acetate ","108-05-4",10,35,null,20,70,null,null,"1B",4,"1B","-","- ","Acute toxicity – category 4\nGerm cell mutagenicity – category 2\nCarcinogenicity – category 2\nSTOT (single exposure) – category 3","Has chronic as well as acute, seems to be clearly a 4. ",null,"1B","Y"]
[null,null,638,"Vinyl bromide (Bromoethylene)","593-60-2",5,22,null,null,null,null,null,3,3,"3","Carc. 1B","-","Germ cell mutagenicity – category 2\nCarcinogenicity – category 1B",null,"Liver cancer",4]
[null,null,639,"Vinyl chloride, monomer (Chloroethylene; Ethene, chloro)","75-01-4",5,13,null,null,null,null,null,3,3,"3","Carc. 1A","-","Carcinogenicity – category 1A\nGerm cell mutagenicity – category 2\nSTOT (repeated exposure) – category 1",null,"Liver cancer; liver damage",4]
[null,null,640,"Vinyl cyclohexene dioxide (1,2-Epoxy-4-(epoxy-ethyl)-cyclohexane)","106-87-6",10,57,null,null,null,null,null,3,3,"3","Carc. 2","Sk","Acute toxicity – category 3\nCarcinogenicity – category 2\nReproductive toxicity – category 2",null,"Female & male repro damage",3]
[null,null,641,"Vinyl toluene (Methyl styrene)","25013-15-4",50,242,null,100,483,null,null,"1B","1B","1B","-","-","-",null,"URT & eye irr","1B"]
[null,null,642,"Vinylidene chloride (1,1-Dichloroethylene)","75-35-4",5,20,null,20,79,null,null,3,3,"3","Carc. 2","-","Acute toxicity – category 4\nEye irritation – category 2A\nCarcinogenicity – category 2\nSTOT (repeated exposure) – category 1",null,"Liver & kidney damage",3]
[null,null,643,"Warfarin","81-81-2",null,0.1,null,null,null,null,null,4,4,"4","-","-","Reproductive toxicity – category 1A\nAcute toxicity – category 1\nAcute toxicity – category 1\nAcute toxicity – category 2\nSTOT (repeated exposure) – category 1",null,"Coagulation",3]
[null,null,644,"Welding fumes (not otherwise classified)",null,null,5,null,null,null,null,null,2,2,"2","-","-","-",null,null,"1B"]
[null,null,645,"White spirits (Stoddard solvent)","8052-41-3",null,790,null,null,null,null,null,4,4,"4","Carc. 1B","-","Carcinogenicity – category 1B\nGerm cell mutagenicity – category 1B\nSTOT (repeated exposure) – category 1",null,"Eye, skin & kidney damage; nausea; CNS impairment",2]
[null,null,646,"Wood dust (certain hardwoods such as beech & oak)",null,null,1,null,null,null,null,null,3,3,"3","-","Sen","-",null,"Asthma; pulm function; URT & LRT irr",3]
[null,null,647,"Wood dust (soft wood)",null,null,5,null,null,10,null,null,3,3,"3","-","Sen ","-",null,"Asthma; pulm function; URT & LRT irr","1C"]
[null,null,648,"Xylene (o-, m-, p- isomers)",null,80,350,null,150,655,null,null,2,2,"2","-","- ","Acute toxicity – category 4\nSTOT (single exposure) – category 3\nSkin irritation – category 2",null,"URT & eye irr; CNS impair","1B"]
[null,null,649,"m-Xylene-alpha,alpha'-diamine (m-Xylylendiamine; 1,3-Benzenedimethanamine)","1477-55-0",null,null,null,null,null,null,0.1,"1A","1A","1A","-","Sk ","-",null,"Eye, skin & GI irr; skin notation","1A"]
[null,null,650,"Xylidine (Dimethylaminobenzene, Aminodimethyl benzene)","1300-73-8",0.5,2.5,null,null,null,null,null,3,3,"3","-","Sk","-",null,"Liver damage; MeHb-emia",3]
[null,null,651,"Yttrium, metal & compounds (as Y)","7440-65-5",null,1,null,null,null,null,null,3,3,"3","-","-","-",null,"Pulmonary fibrosis",3]
[null,null,652,"Zinc chloride (fume)","7646-85-7",null,1,null,null,2,null,null,2,2,"2","-","-","Acute toxicity – category 4\nSkin corrosion – category 1",null,"LRT & URT irr",2]
[null,null,653,"Zinc chromates (as Cr) [11103-86-9, 13530-65-9, 37300-23-5]","13530-65-9",null,0.01,null,null,null,null,null,3,4,"3","Carc. 1A","Sen","Acute toxicity – category 4\nAcute toxicity – category 3\nCarcinogenicity – category 1A\nSTOT (repeated exposure) – category 2\nSkin sensitisation – category 1","Has significant acute as well as toxic effects.","Nasal cancer",3,"Y"]
[null,null,654,"Zinc oxide (dust) ","1314-13-2",null,10,null,null,null,null,null,"1C","1C","1C","-","- ","-",null,"Metal fume fever","1C"]
[null,null,655,"Zinc oxide (fume)","1314-13-2",null,5,null,null,10,null,null,2,2,"2","-","- ","-",null,"Metal fume fever",2]
[null,null,656,"Zirconium compounds (as Zr)","7440-67-7",null,5,null,null,10,null,null,"1C","1C","1C","-","- ","-",null,"Respiratory irr",4]

{"sheet":"OLD_WES List","index":15,"n_rows":662,"n_cols":22,"rows_kept":662,"cut":false,"hidden":true,"merged":[]}
[]
[null,null,"Safe Work Australia (SWA) TWA WES Values with Adjustment Codes"]
[]
[]
[]
[null,null,"#","SWA chemical names","CAS","TWA (ppm)","TWA (mg/m³)","TWA (f/mL)","STEL (ppm)","STEL (mg/m³)","Peak (ppm)","Peak (mg/m³)","Current Adj","Proposed Adj","Quebec Model Adj","Carcinogen Category","Notices","Hazard Category","Rationale for change or comment","ACGIH Documentation (2016)","UWHA Code","Changed"]
[null,null,1,"Acetaldehyde ","75-07-0",20,36,null,50,91,null,null,"1B",4,"1A","Carc. 2 ","-","Acute toxicity – category 4\nCarcinogenicity – category 2\nGerm cell mutagenicity – category 2\nSpecific target organ toxicity (STOT - single exposure) – category 3\nEye irritation – category 2A","Has health effects after both short and long term exposure.  In addition, ACGIH has a Ceiling value, but SWA has no Peak","Eye & upper respiratory tract (URT) irritation; ceiling value assigned","1A","Y"]
[null,null,2,"Acetic acid","64-19-7",10,25,null,15,37,null,null,"1B","1B","1B","-","-","Skin corrosion – category 1A",null,"URT & eye irr; pulm func","1B"]
[null,null,3,"Acetic anhydride","108-24-7",null,null,null,null,null,5,21,"1A","1A","1B","-","-","Acute toxicity – category 4\nSkin corrosion – category 1B",null,"Eye & URT irr (plus burns)","1B"]
[null,null,4,"Acetone","67-64-1",500,1185,null,1000,2375,null,null,"1C",2,"1C","-","-","Eye irritation – category 2A\nSTOT (single exposure) – category 3","Acute effect is drowsiness, Classifying as 2 allows WES reduction for longer shifts which seems appropriate as it already has a very high WES","URT & eye irr; CNS impairment","1B","Y"]
[null,null,5,"Acetonitrile","75-05-8",40,67,null,60,101,null,null,2,2,"2","-","Sk","Acute toxicity – category 4\nEye irritation – category 2",null,"LRT irr; skin notation",4]
[null,null,6,"Acetylsalicylic acid (Aspirin)","50-78-2",null,5,null,null,null,null,null,2,2,"2","-","-","-",null,"Skin, eye & GI irr; blood effects",4]
[null,null,7,"Acrolein","107-02-8",0.1,0.23,null,0.3,0.69,null,null,"1B","1A","1B","-","-","Acute toxicity – category 1\nAcute toxicity – category 2\nAcute toxicity – category 3\nSkin corrosion – category 1B","Is an intense irritant, 1B is more designed for mild irritants. ACGIH rationale for ceiling seems sound.","Eye & URT irr; pulm edema; pulm emphysema; ceiling value assigned","1A","Y"]
[null,null,8,"Acrylamide (Acrylaldehyde)","79-06-1",null,0.03,null,null,null,null,null,3,3,"3","Carc. 1B","Sk:Sen","Carcinogenicity – category 1B\nGerm cell mutagenicity – category 1B\nReproductive toxicity – category 2\nAcute toxicity – category 3\nSTOT (repeated exposure) – category 1\nAcute toxicity – category 4\nEye irritation – category 2A\nSkin irritation – category 2\nSkin sensitisation – category 1\nSTOT (repeated exposure) – category 2",null,"CNS impairment; skin notation",4]
[null,null,9,"Acrylic acid","79-10-7",2,5.9,null,null,null,null,null,4,4,"1B","-","Sk","Acute toxicity – category 4\nAcute toxicity – category 3\nSkin corrosion – category 1A",null,"URT & eye irr; pulmonary function effect; skin notation",4]
[null,null,10,"Acrylonitrile (Vinyl cyanide)","107-13-1",2,4.3,null,null,null,null,null,4,4,"3","Carc. 1B","Sk:Sen","Carcinogenicity – category 1B\nAcute toxicity – category 3\nSTOT (single exposure) – category 3\nSkin irritation – category 2\nEye damage – category 1",null,"CNS impairment; LRT irr; skin notation",4]
[null,null,11,"Aldrin","309-00-2",null,0.25,null,null,null,null,null,4,4,"4","Carc. 2","Sk","Carcinogenicity – category 2\nAcute toxicity – category 3\nSTOT (repeated exposure) – category 1",null,"CNS impairment; liver & kidney damage",4]
[null,null,12,"Allyl alcohol","107-18-6",2,4.8,null,4,9.5,null,null,2,2,"1B","-","Sk","Acute toxicity – category 3\nSTOT (single exposure) – category 3\nEye irritation – category 2\nSkin irritation – category 2",null,"Eye & URT irr; skin notation",4]
[null,null,13,"Allyl chloride (3-Chloro-1-propene)","107-05-1",1,3,null,2,6,null,null,4,4,"3","Carc. 2","-","Acute toxicity – category 4\nGerm cell mutagenicity – category 2\nEye irritation – category 2A\nSkin irritation – category 2\nSTOT (repeated exposure) – category 2\nReproductive toxicity – category 2",null,"Eye & URT irr; liver & kidney damage",4]
[null,null,14,"Allyl glycidyl ether (AGE) (Allyl 2,3-epoxypropyl ether)","106-92-3",5,23,null,10,47,null,null,4,4,"1B","Carc. 2","Sk:Sen","Acute toxicity – category 4\nSkin irritation – category 2\nEye damage – category 1\nSkin sensitisation – category 1\nGerm cell mutagenicity – category 2\nCarcinogenicity – category 2\nReproductive toxicity – category 2\nSTOT (single exposure) – category 3",null,"URT irr; dermatitis; eye & skin irr","1B"]
[null,null,15,"Allyl propyl disulfide","2179-59-1",2,12,null,3,18,null,null,"1B","1B","1B","-","- ","-",null,"Eye & URT irr","1B"]
[null,null,16,"Aluminium (metal dust)","7429-90-5",null,10,null,null,null,null,null,"1C","1C","1C","-","- ","-",null,"Pneumoconiosis; LRT irr; neurotoxicity","1C"]
[null,null,17,"Aluminium (welding fumes) (as Al)","7429-90-5",null,5,null,null,null,null,null,"1C","1C","1C","-","- ","-",null,"Pneumoconiosis; LRT irr; neurotoxicity","1B"]
[null,null,18,"Aluminium oxide (alpha-Alumina (Al2O3))","1344-28-1",null,10,null,null,null,null,null,"1C","1C","1C","-","- ","-",null,"Pneumoconiosis; LRT irr; neurotoxicity","1C"]
[null,null,19,"Aluminium, alkyls (NOC) (as Al)","7429-90-5",null,2,null,null,null,null,null,"1B","1B","1B","-","- ","-",null,null,"1B"]
[null,null,20,"Aluminium, pyro powders (as Al)","7429-90-5",null,5,null,null,null,null,null,"1C","1C","1C","-","- ","-",null,null,3]
[null,null,21,"Aluminium, soluble salts (as Al)","7429-90-5",null,2,null,null,null,null,null,"1B","1B","1B","-","- ","-",null,null,"1B"]
[null,null,22,"2-Aminopyridine (2-Pyridylamine)","504-29-0",0.5,2,null,null,null,null,null,2,2,"2","-","- ","-",null,null,2]
[null,null,23,"Amitrole (3-Amino-1,2,4-triazole)","61-82-5",null,0.2,null,null,null,null,null,3,3,"3","-","-","Reproductive toxicity – category 2\nSTOT(repeated exposure) – category 2",null,null,3]
[null,null,24,"Ammonia","7664-41-7",25,17,null,35,24,null,null,"1B","1B","1B","-","- ","Acute toxicity – category 4\nSkin corrosion – category 1",null,"Eye damage; URT irr","1B"]
[null,null,25,"Ammonium chloride (fume)","12125-02-9",null,10,null,null,20,null,null,"1B","1B","1B","-","- ","Acute toxicity – category 4\nEye irritation – category 2A",null,"Eye & URT irr","1C"]
[null,null,26,"Ammonium perfluorooctanoate ","3825-26-1",null,0.1,null,null,null,null,null,3,3,"3","-","- ","Acute toxicity – category 3\nCarcinogenicity – category 2\nEye irritation – category 2A\nSTOT (repeated exposure) – category 1\nReproductive toxicity – category 1B",null,"Liver damage",4]
[null,null,27,"Ammonium Persulfate","7727-54-0",null,null,null,null,null,null,0.01,2,"1A",null,"-","Sen","Acute toxicity – category 4\nSkin irritation – category 2\nEye irritation – category 2A\nRespiratory sensitisation – category 1\nSkin sensitisation – category 1\nSTOT (single exposure) – category 3","Could be changed to Cat 2 based on GHS sensitisation and STOT classification, but there is no TWA WES.  It is an irritant with only a peak value, hence should be a Cat 1A.","Skin irr; (NIOSH Int Chem Safety Card - URT irr,  sore throat, wheezing)","1B","Y"]
[null,null,28,"Ammonium sulphamate (Ammate)","7773-06-0",null,10,null,null,null,null,null,"1B","1B","1B","-","-","-",null,null,"1C"]
[null,null,29,"n-Amyl acetate (Pentyl acetate)","628-63-7",50,270,null,100,541,null,null,"1B","1B","1B","-","-","-",null,"URT irr (narcosis & developmental effects at high levels)","1B"]
[null,null,30,"sec-Amyl acetate (1-Methylbutyl acetate)","626-38-0",50,270,null,100,541,null,null,"1B","1B","1B","-","-","-",null,"URT irr (narcosis & developmental effects at high levels)","1B"]
[null,null,31,"Aniline & homologues","62-53-3",2,7.6,null,null,null,null,null,4,4,"1C","Carc. 2","Sk:Sen","Carcinogenicity – category 2\nGerm cell mutagenicity – category 2\nAcute toxicity – category 3\nSTOT (repeated exposure) – category 1\nEye damage – category 1\nSkin sensitisation – category 1",null,"MeHb-emia; skin notation",4]
[null,null,32,"Anisidine (o-, p- isomers) (Methoxyaniline)","29191-52-4",0.1,0.5,null,null,null,null,null,4,3,"2","Carc. 1B","Sk","-","Only long-term exposure effects are indicated.","MeHb-emia; skin notation",3,"Y"]
[null,null,33,"Antimony & compounds (as Sb)","7440-36-0",null,0.5,null,null,null,null,null,3,3,"3","-","-","-",null,"Skin & URT irr",4]
[null,null,34,"Antimony trioxide, handling and use (as Sb)","1309-64-4",null,0.5,null,null,null,null,null,3,3,"3","Carc. 2","-","Carcinogenicity – category 2",null,"Lung cancer; pneumoconiosis","1C"]
[null,null,35,"ANTU (1-Naphthylthiourea)","86-88-4",null,0.3,null,null,null,null,null,2,4,"2","Carc. 2","-","Acute toxicity – category 2\nCarcinogenicity – category 2","Has both acute and chronic (cancer) effects.","Thyroid effects; nausea; skin notation",2,"Y"]
[null,null,36,"Arsenic & soluble compounds (as As)","7440-38-2",null,0.05,null,null,null,null,null,3,4,"3","Some are Carc. 1","Some are Sen","Acute toxicity – category 3\nCarcinogenicity – category 1A\nGerm cell mutagenicity – category 2\nSTOT (repeated exposure) – category 2","Has acute (Toxic if swallowed - GHS) as well as chronic (cancer) effects. Half life is 4-6 hours (Mayomedical labs) or 10 hours (ATSDR).","Lung cancer",3,"Y"]
[null,null,37,"Arsine","7784-42-1",0.05,0.16,null,null,null,null,null,4,4,"4","-","-","Acute toxicity – category 1\nCarcinogenicity – category 1A\nSTOT (repeated exposure) – category 1",null,"PNS & vascular system impairment; kidney & liver impairment",4]
[null,null,38,"Asbestos - Any mixture of commercial species, or where the composition is unknown","1332-21-4",null,null,0.1,null,null,null,null,3,3,null,"Carc. 1A","-","-",null,"Pneumoconiosis; lung cancer; mesothelioma",3]
[null,null,39,"Asbestos - Amosite ","12172-73-5",null,null,0.1,null,null,null,null,3,3,"3","Carc. 1A","-","Carcinogenicity – category 1A\nSTOT (repeated exposure) – category 1",null,"Pneumoconiosis; lung cancer; mesothelioma",3]
[null,null,40,"Asbestos - Chrysotile ","12001-29-5",null,null,0.1,null,null,null,null,3,3,"3","Carc. 1A","-","Carcinogenicity – category 1A\nSTOT (repeated exposure) – category 1",null,"Pneumoconiosis; lung cancer; mesothelioma",3]
[null,null,41,"Asbestos - Crocidolite ","12001-28-4",null,null,0.1,null,null,null,null,3,3,"3","Carc. 1A","-","Carcinogenicity – category 1A\nSTOT (repeated exposure) – category 1",null,"Pneumoconiosis; lung cancer; mesothelioma",3]
[null,null,42,"Asbestos - Other forms ",null,null,null,0.1,null,null,null,null,3,3,"3","Carc. 1A","-","-",null,"Pneumoconiosis; lung cancer; mesothelioma",3]
[null,null,43,"Atrazine","1912-24-9",null,5,null,null,null,null,null,2,3,"2","-","Sen","STOT (repeated exposure) – category 2\nSkin sensitisation – category 1","Appears to have only long-term effects.","Haematological, reproductive & developmental effects",3,"Y"]
[null,null,44,"Azinphos-methyl (Guthion)","86-50-0",null,0.2,null,null,null,null,null,4,4,"4","-","Sk:Sen","Acute toxicity – category 2\nAcute toxicity – category 3\nSkin sensitisation – category 1",null,"Cholinesterase inhib; skin notation & sensitiser",2]
[null,null,45,"Barium sulphate ","7727-43-7",null,10,null,null,null,null,null,3,3,"3","-","-","-",null,"Pneumoconiosis",3]
[null,null,46,"Barium, soluble compounds (as Ba)","7440-39-3",null,0.5,null,null,null,null,null,2,2,"2","-","- ","-",null,"Eye, skin & GI irr; muscular stimulant",4]
[null,null,47,"Benomyl (Benlate)","17804-35-2",0.84,10,null,null,null,null,null,4,4,"1C","-","Sen","Germ cell mutagenicity – category 1B\nReproductive toxicity – category 1B\nSTOT (single exposure) – category 3\nSkin irritation – category 2\nSkin sensitisation – category 1",null,"URT irr; male repro & testicular damage; embryo/foetal damage","1C"]
[null,null,48,"Benzene","71-43-2",1,3.2,null,null,null,null,null,3,3,"3","Carc. 1A","-","Carcinogenicity – category 1A\nGerm cell mutagenicity – category 1B\nSTOT (repeated exposure) – category 1\nEye irritation – category 2\nSkin irritation – category 2",null,null,3]
[null,null,49,"Benzoyl peroxide (Dibenzoyl peroxide)","94-36-0",null,5,null,null,null,null,null,"1B","1B","1B","-","Sen","Eye irritation – category 2A\nSkin sensitisation – category 1",null,"URT & skin irr","1B"]
[null,null,50,"Benzyl chloride (alpha-Chlorotoluene)","100-44-7",1,5.2,null,null,null,null,null,4,4,"4","-","-","Acute toxicity – category 4\nAcute toxicity – category 3\nCarcinogenicity – category 1B\nEye damage – category 1\nSTOT (single exposure) – category 3\nSTOT (repeated exposure) – category 2\nSkin sensitisation – category 1\nSkin irritation – category 2 ",null,"Eye, skin & URT irr","1B"]
[null,null,51,"Beryllium & compounds","7440-41-7",null,2E-3,null,null,null,null,null,3,3,"3","Some are Carc. 1","Some are Sen","Acute toxicity – category 1\nCarcinogenicity – category 1B\nSTOT (single exposure) – category 3\nSTOT (repeated exposure) – category 1\nRespiratory sensitisation – category 1\nSkin sensitisation – category 1",null,"Beryllium sens; berylliosis",3]
[null,null,52,"Biphenyl (Diphenyl, Phenylbenzene)","92-52-4",0.2,1.3,null,null,null,null,null,3,"1B","1B","-","-","Eye irritation – category 2\nSTOT (single exposure) – category 3\nSkin irritation – category 2","ACGIH TLV and GHS hazard category point to short-term effects related to irritation mainly.","Potential for irritation of nasal mucosa & respiratory difficulties in rats & mice",3,"Y"]
[null,null,53,"Bismuth telluride (Dibismuth tritelluride)","1304-82-1",null,10,null,null,null,null,null,"1C","1C","1C","-","-","-",null,"Lung damage - reversible & mild",3]
[null,null,54,"Bismuth telluride, Se-doped","1304-82-1",null,5,null,null,null,null,null,3,3,3,"-","-","-",null,"Lung damage","1C"]
[null,null,55,"Bitumen fumes (Asphalt (petroleum))","8052-42-4",null,5,null,null,null,null,null,4,4,"3","-","-","-",null,"Eye & URT irr",3]
[null,null,56,"Borates, tetra, sodium salts (anhydrous) (Disodium tetraborate anhydrous)","1330-43-4",null,1,null,null,null,null,null,"1B","1B","1B","-","-","Reproductive toxicity – category 1B",null,"URT irr","1B"]
[null,null,57,"Borates, tetra, sodium salts (decahydrate) (Disodium tetraborate decahydrate, Borax)","1303-96-4",null,5,null,null,null,null,null,"1B","1B","1B","-","-","Reproductive toxicity – category 1B",null,"URT irr","1B"]
[null,null,58,"Borates, tetra, sodium salts (pentahydrate) (Disodium tetraborate pentahydrate)","12179-04-3",null,1,null,null,null,null,null,"1B","1B","1B","-","-","Reproductive toxicity – category 1B",null,"URT irr","1B"]
[null,null,59,"Boron oxide (Diboron trioxide)","1303-86-2",null,10,null,null,null,null,null,"1B","1B","1B","-","-","Reproductive toxicity – category 1B",null,"Eye & URT irr","1B"]
[null,null,60,"Boron tribromide","10294-33-4",null,null,null,null,null,1,10,"1A","1A","1A","-","-","Acute toxicity – category 2\nSkin corrosion – category 1A",null,"Resp tract irritant; pneumonitis","1A"]
[null,null,61,"Boron trifluoride","7637-07-2",null,null,null,null,null,1,2.8,"1A","1A","1A","-","-","Acute toxicity – category 2\nSkin corrosion – category 1A",null,"Resp tract irritant; pneumonitis","1A"]
[null,null,62,"Bromacil","314-40-9",1,11,null,null,null,null,null,3,3,"3","-","-","-",null,"Thyroid eff","1C"]
[null,null,63,"Bromine","7726-95-6",0.1,0.66,null,0.3,2,null,null,"1B","1B","1B","-","-","Acute toxicity – category 2\nSkin corrosion – category 1A",null,"URT & LRT irr; lung damage","1B"]
[null,null,64,"Bromine pentafluoride","7789-30-2",0.1,0.72,null,null,null,null,null,"1B","1B","1B","-","-","-",null,"Eye, skin & URT irr","1B"]
[null,null,65,"Bromoform (Tribromomethane)","75-25-2",0.5,5.2,null,null,null,null,null,4,4,"4","-","Sk","Acute toxicity – category 3\nAcute toxicity – category 4\nEye irritation – category 2\nSkin irritation – category 2",null,"Liver damage; URT & eye irr",3]
[null,null,66,"1,3-Butadiene ","106-99-0",10,22,null,null,null,null,null,3,3,"3","Carc. 1A","-","Carcinogenicity – category 1A\nGerm cell mutagenicity – category 1B\nReproductive toxicity – category 2",null,"Cancer",3]
[null,null,67,"Butane","106-97-8",800,1900,null,null,null,null,null,"1C","1C","1C","-","- ","-",null,"CNS impairment",2]
[null,null,68,"2-Butoxyethanol (Butyl cellosolve, Butyl glycol, Ethylene glycol)","111-76-2",20,96.9,null,50,242,null,null,"1B","1B","3","-","Sk ","Acute toxicity – category 4\nEye irritation – category 2\nSkin irritation – category 2","ACGIH no longer recommend a skin notation.","Eye & URT irr","1B"]
[null,null,69,"2-Butoxyethyl acetate","112-07-2",20,133,null,50,333,null,null,"1B","1B",null,"-","Sk ","Acute toxicity – category 4","ACGIH no longer recommend a skin notation.  UK HSE documentation - Eye & URT irr.","Haemolisis (in animal tests)"]
[null,null,70,"n-Butyl acetate","123-86-4",150,713,null,200,950,null,null,"1B",2,"1B","-","- ","STOT (single exposure) – category 3","Acute effect is drowsiness, category 2 recommended using same logic as acetone.","Eye & URT irr","1B","Y"]
[null,null,71,"sec-Butyl acetate","105-46-4",200,950,null,null,null,null,null,"1B",2,"1B","-","- ","-","Acute effect is drowsiness, category 2 recommended using same logic as acetone.","Eye & URT irr","1B","Y"]
[null,null,72,"tert-Butyl acetate","540-88-5",200,950,null,null,null,null,null,"1B",2,"1B","-","- ","STOT (single exposure) – category 3","Acute effect is drowsiness, category 2 recommended using same logic as acetone.","Eye & URT irr","1B","Y"]
[null,null,73,"n-Butyl acrylate (Acrylic acid, n-butyl ester)","141-32-2",1,5,null,5,26,null,null,4,4,"1B","-","Sen","Acute toxicity – category 4\nEye irritation – category 2A\nSkin irritation – category 2\nSTOT (single exposure) – category 3\nSkin sensitisation – category 1",null,"Skin, eye & URT irr",4]
[null,null,74,"n-Butyl alcohol (n-Butanol)","71-36-3",null,null,null,null,null,50,152,"1A","1A","1A","-","Sk ","Acute toxicity – category 4\nSkin irritation – category 2\nSTOT (single exposure) – category 3\nEye damage – category 1","Possibly a Cat 2 given GHS STOT hazard category, but remains a Cat 1A given it has only a peak value.","Eye & URT irr","1A","M"]
[null,null,75,"sec-Butyl alcohol (sec-Butanol, Butan-2-ol)","78-92-2",100,303,null,null,null,null,null,2,2,"2","-","- ","Eye irritation – category 2\nSTOT (single exposure) – category 3",null,"URT irr; CNS impair",2]
[null,null,76,"tert-Butyl alcohol (tert-Butanol, 2-Methylpropan-2-ol)","75-65-0",100,303,null,150,455,null,null,2,2,"2","-","- ","Acute toxicity – category 4\nEye damage – category 1\nSTOT (single exposure) – category 3",null,"CNS impairment",2]
[null,null,77,"tert-Butyl chromate (as CrO3)","1189-85-1",null,null,null,null,null,null,0.1,"1A","1A","1A","-","Sk ","-",null,"LRT & skin irr","1A"]
[null,null,78,"n-Butyl glycidyl ether (BGE) (1-Butoxy-2,3-epoxypropane, Butyl-2,3-epoxypropyl ether)","2426-08-6",25,133,null,null,null,null,null,3,3,"3","Carc. 2","Sen ","Acute toxicity – category 4\nSkin irritation – category 2\nEye irritation – category 2A\nSkin sensitisation – category 1\nGerm cell mutagenicity – category 2\nCarcinogenicity – category 2\nReproductive toxicity – category 2\nSTOT (single exposure) – category 3",null,"Repro damage",2]
[null,null,79,"n-Butyl lactate","138-22-7",5,30,null,null,null,null,null,"1B","1B","1B","-","- ","-",null,"Headache; URT irr","1B"]
[null,null,80,"Butyl mercaptan (Butanethiol)","109-79-5",0.5,1.8,null,null,null,null,null,"1B","1B","1B","-","- ","-",null,"URT irr",2]
[null,null,81,"Butylamine","109-73-9",null,null,null,null,null,5,15,"1A","1A","1A","-","Sk ","Acute toxicity – category 4\nSkin corrosion – category 1A",null,"Headache; URT & eye irr; skin notation","1A"]
[null,null,82,"o-sec-Butylphenol","89-72-5",5,31,null,null,null,null,null,"1B","1B","1B","-","Sk ","-",null,"Eye, skin & URT irr",2]
[null,null,83,"p-tert-Butyltoluene ","98-51-1",10,61,null,20,121,null,null,3,3,"3","-","- ","-",null,"Eye & URT irr; nausea",4]
[null,null,84,"Cadmium and compounds (as Cd)","7440-43-9",null,0.01,null,null,null,null,null,3,3,"3","Some are Carc. 1","Some are Sen","Carcinogenicity – category 1B\nGerm cell mutagenicity – category 2\nReproductive toxicity – category 2\nAcute toxicity – category 2\nSTOT (repeated exposure) – category 1","Remains as Cat 3 as biological half life is long.","Kidney damage",3]
[null,null,85,"Caesium hydroxide","21351-79-1",null,2,null,null,null,null,null,"1B","1B","1B","-","- ","-",null,"URT, skin & eye irr","1B"]
[null,null,86,"Calcium carbonate (Limestone, Marble)","471-34-1",null,10,null,null,null,null,null,"1C","1C","1C","-","- ","-",null,null,"1C"]
[null,null,87,"Calcium cyanamide (Calcium carbimide)","156-62-7",null,0.5,null,null,null,null,null,"1B","1B","1B","-","- ","Acute toxicity – category 4\nSTOT (single exposure) – category 3\nEye damage – category 1","Possibly a Cat 2 given GHS STOT hazard category.","Eye & URT irr",4,"M"]
[null,null,88,"Calcium hydroxide (slaked lime)","1305-62-0",null,5,null,null,null,null,null,"1B","1B","1B","-","- ","Skin irritation – category 2\nEye damage – category 1",null,"Eye, skin & URT irr","1B"]
[null,null,89,"Calcium oxide (lime)","1305-78-8",null,2,null,null,null,null,null,"1B","1B","1B","-","- ","Skin irritation – category 2\nEye damage – category 1\nSTOT (single exposure) – category 3","Possibly a Cat 2 given GHS STOT hazard category.","URT irr","1B","M"]
[null,null,90,"Calcium silicate ","1344-95-2",null,10,null,null,null,null,null,"1C","1C","1C","-","- ","-",null,"Pneumoconiosis; pulmonary function effects","1C"]
[null,null,91,"Calcium sulphate (Gypsum, Plaster of Paris)","7778-18-9",null,10,null,null,null,null,null,"1C","1C","1C","-","- ","-",null,"Nasal symptoms","1C"]
[null,null,92,"Camphor, synthetic (Bornan-2-one)","76-22-2",2,12,null,3,19,null,null,"1B","1B","1B","-","- ","-",null,"Eye & URT irr; anosmia",4]
[null,null,93,"e-Caprolactam (dust and vapour) (1,6-Hexanelactam, Hexahydro-2H-azepin-2-one)","105-60-2",null,10,null,null,20,null,null,"1B","1B","1B","-","- ","Acute toxicity – category 4\nEye irritation – category 2\nSTOT (single exposure) – category 3\nSkin irritation – category 2","Possibly a Cat 2 given GHS STOT hazard category.","URT irr",2,"M"]
[null,null,94,"Caprolactam (dust)","105-60-2",null,1,null,null,3,null,null,"1B","1B","1B","-","- ","Acute toxicity – category 4\nEye irritation – category 2\nSTOT (single exposure) – category 3\nSkin irritation – category 2","Possibly a Cat 2 given GHS STOT hazard category.","URT irr",2,"M"]
[null,null,95,"Captafol (Difolatan)","2425-06-1",null,0.1,null,null,null,null,null,4,4,"3","Carc. 1B","Sk:Sen","Carcinogenicity – category 1B\nSkin sensitisation – category 1",null,"Skin irr & dermatitis; skin notation & sensitisation",4]
[null,null,96,"Captan","133-06-2",null,0.5,null,null,null,null,null,4,4,"3","Carc. 2","Sk:Sen","Acute toxicity – category 3\nEye damage – category 1\nSkin sensitisation – category 1\nGerm cell mutagenicity – category 1B\nCarcinogenicity – category 2",null,"Skin irr","1B"]
[null,null,97,"Carbaryl (Sevin)","63-25-2",null,5,null,null,null,null,null,4,4,"4","Carc. 2","-","Carcinogenicity – category 2\nAcute toxicity – category 4\nAcute toxicity – category 4",null,"Cholinesterase inhib; male repro damage; embryo damage",4]
[null,null,98,"Carbofuran (Furadan)","1563-66-2",null,0.1,null,null,null,null,null,4,4,"4","-","-","Acute toxicity – category 2\nAcute toxicity – category 2",null,"Cholinesterase inhib",4]
[null,null,99,"Carbon black","1333-86-4",null,3,null,null,null,null,null,3,3,"3","-","-","STOT (repeated exposure) – category 2",null,"Bronchitis","1C"]
[null,null,100,"Carbon dioxide","124-38-9",5000,9000,null,30000,54000,null,null,"1C","1C","1C","-","-","-",null,"Asphyxia","1C"]
[null,null,101,"Carbon dioxide in coal mines","124-38-9",12500,22500,null,30000,54000,null,null,"1C","1C",null,"-","-","-",null,null,"1C"]
[null,null,102,"Carbon disulphide","75-15-0",10,31,null,null,null,null,null,4,4,"4","-","Sk","Acute toxicity – category 4\nEye irritation – category 2A\nSkin irritation – category 2\nSTOT (repeated exposure) – category 1\nReproductive toxicity – category 2",null,"PNS impair",4]
[null,null,103,"Carbon monoxide ","630-08-0",30,34,null,null,null,null,null,4,4,"4",null,"-","Reproductive toxicity – category 1A\nAcute toxicity – category 3\nSTOT (repeated exposure) – category 1",null,"COHb-emia",2]
[null,null,104,"Carbon tetrabromide (Tetrabromomethane)","558-13-4",0.1,1.4,null,0.3,4.0999999999999996,null,null,4,4,"4","-","-","-",null,"Liver damage; eye, URT & skin irr",4]
[null,null,105,"Carbon tetrachloride (Tetrachloromethane)","56-23-5",0.1,0.63,null,null,null,null,null,4,4,"4","Carc. 2","Sk","Carcinogenicity – category 2\nAcute toxicity – category 3\nSTOT (repeated exposure) – category 1",null,"Liver damage",4]
[null,null,106,"Carbonyl fluoride","353-50-4",2,5.4,null,5,13,null,null,4,4,"4","-","-","-",null,null,4]
[null,null,107,"Catechol (Pyrocatechol, o-Dihydroxybenzene, 1,2-Benzenediol)","120-80-9",5,23,null,null,null,null,null,4,4,"4","-","-","Acute toxicity – category 3\nCarcinogenicity – category 2\nGerm cell mutagenicity – category 2\nEye irritation – category 2A\nSkin sensitisation – category 1",null,null,4]
[null,null,108,"Cellulose (paper fibre) ","9004-34-6",null,10,null,null,null,null,null,"1C","1C","1C","-","-","-",null,"URT irr","1C"]
[null,null,109,"Chlordane","57-74-9",null,0.5,null,null,null,null,null,4,4,"4","Carc. 2","Sk","Carcinogenicity – category 2\nAcute toxicity – category 4",null,null,4]
[null,null,110,"Chlorinated camphene (Camphechlor)","8001-35-2",null,0.5,null,null,1,null,null,4,4,"4","Carc. 2","Sk","Carcinogenicity – category 2\nAcute toxicity – category 3\nAcute toxicity – category 4\nSTOT (single exposure) – category 3\nSkin irritation – category 2 ",null,null,4]
[null,null,111,"Chlorinated diphenyl oxide","31242-93-0",null,0.5,null,null,null,null,null,3,3,"3","-","-","-",null,"Chloracne; liver damage",4]
[null,null,112,"Chlorine","7782-50-5",null,null,null,null,null,1,3,"1A","1A","1C","-","- ","Acute toxicity – category 3\nEye irritation – category 2\nSTOT (single exposure) – category 3\nSkin irritation – category 2","Possibly a Cat 2 given GHS STOT hazard category.  Should be a Cat 1A given it has only a peak value.","URT & eye irr","1B","M"]
[null,null,113,"Chlorine dioxide","10049-04-4",0.1,0.28000000000000003,null,0.3,0.83,null,null,2,2,"2","-","- ","Oxidising gas – category 1\nAcute toxicity – category 2\nSkin corrosion – category 1B",null,"LRT irr; bronchitis","1B"]
[null,null,114,"Chlorine trifluoride","7790-91-2",null,null,null,null,null,0.1,0.38,"1A","1A","1A","-","- ","- ",null,"Eye & URT irr; lung damage","1A"]
[null,null,115,"1-Chloro-1-nitropropane","600-25-9",2,10,null,null,null,null,null,2,2,"2","-","- ","Acute toxicity – category 4",null,"Eye irr; pulmonary oedema",4]
[null,null,116,"Chloroacetaldehyde","107-20-0",null,null,null,null,null,1,3.2,"1A","1A","1A","Carc. 2","-","Carcinogenicity – category 2\nAcute toxicity – category 2\nAcute toxicity – category 3\nSkin corrosion – category 1B","Should be changed to Cat 4 based on GHS chronic health and acute toxicity, but there is no TWA WES.  It is an irritant with only a peak / ceiling value, hence remains Cat 1A.","URT & eye irr (possible mutagen)","1A","M"]
[null,null,117,"Chloroacetone","78-95-5",null,null,null,null,null,1,3.8,"1A","1A","1A","-","Sk","-",null,"Eye & URT irr; skin notation","1A"]
[null,null,118,"alpha-Chloroacetophenone (Phenacyl chloride)","532-27-4",0.05,0.32,null,null,null,null,null,"1B","1B","1B","-","-","-",null,"Eye, URT & skin irr","1B"]
[null,null,119,"Chloroacetyl chloride (Chloroacetic acid chloride)","79-04-9",0.05,0.23,null,0.15,0.69,null,null,"1B",4,"1B","-","Sk","Acute toxicity – category 3\nSTOT (repeated exposure) – category 1\nSkin corrosion – category 1A","Has health effects after both short and long term exposure.  In addition, ACGIH and SWA has a STEL value.","URT irr; skin notation","1B","Y"]
[null,null,120,"Chlorobenzene","108-90-7",10,46,null,null,null,null,null,4,4,"4","-","-","Acute toxicity – category 4\nSkin irritation – category 2",null,"Liver damage",4]
[null,null,121,"o-Chlorobenzylidene malononitrile","2698-41-1",null,null,null,null,null,0.05,0.39,"1A","1A","1A","-","Sk","-",null,"URT irr; skin sens; skin notation","1A"]
[null,null,122,"Chlorobromomethane (Bromochloromethane)","74-97-5",200,1060,null,null,null,null,null,3,3,"3","-","-","-",null,"CNS impairment; liver damage",4]
[null,null,123,"Chlorodifluoromethane (Difluorochloromethane, Fluorocarbon 22, Freon 22)","75-45-6",1000,3540,null,null,null,null,null,"1C","1C","1C","-","-","-",null,"CNS impairment; asphyxia; cardiac sensitisation",4]
[null,null,124,"Chloroform (Trichloromethane)","67-66-3",2,10,null,null,null,null,null,4,4,"4","Carc. 2","Sk","Acute toxicity – category 4\nAcute toxicity – category 3\nCarcinogenicity – category 2\nEye irritation – category 2A\nSkin irritation – category 2\nSTOT (repeated exposure) – category 2",null,"Liver damage; embryo/foetal damage; CNS impairment",4]
[null,null,125,"bis(Chloromethyl) ether","542-88-1",1E-3,5.0000000000000001E-3,null,null,null,null,null,3,3,"3","Carc. 1A","-","Carcinogenicity – category 1A\nAcute toxicity – category 2\nAcute toxicity – category 3\nAcute toxicity – category 4 ",null,null,3]
[null,null,126,"Chloropentafluoroethane (Fluorocarbon 115, Freon 115)","76-15-3",1000,6320,null,null,null,null,null,"1C","1C","1C","-","-","-",null,"Cardiac sensitisation",4]
[null,null,127,"Chloropicrin (Trichloronitromethane)","76-06-2",0.1,0.67,null,null,null,null,null,2,2,"2","-","-","Acute toxicity – category 1\nAcute toxicity – category 4\nSTOT (repeated exposure) – category 1\nEye irritation – category 2\nSkin irritation – category 2\nSTOT (single exposure) – category 3",null,"Eye irr; pulmonary oedema","1B"]
[null,null,128,"beta-Chloroprene (2-Chloro-1,3-butadiene)","126-99-8",10,36,null,null,null,null,null,4,4,"4","Carc. 1B","Sk","Carcinogenicity – category 1B\nAcute toxicity – category 4\nEye irritation – category 2\nSTOT (single exposure) – category 3\nSkin irritation – category 2\nSTOT (repeated exposure) – category 2",null,null,4]
[null,null,129,"2-Chloropropionic acid","598-78-7",0.1,0.44,null,null,null,null,null,3,3,"3","-","Sk","Acute toxicity – category 4\nSkin corrosion – category 1A",null,"Male repro damage",4]
[null,null,130,"o-Chlorostyrene","2039-87-4",50,283,null,75,425,null,null,4,4,"4","-","-","-",null,null,4]
[null,null,131,"Chlorosulphonic acid","7790-94-5",0.20899999999999999,1,null,null,null,null,null,2,2,null,"-","-","Skin corrosion – category 1A\nSTOT (single exposure) – category 3",null,"(URT irr; corrosive to eyes, skin & mucous membranes (+ chronic effects?))"]
[null,null,132,"o-Chlorotoluene","95-49-8",50,259,null,null,null,null,null,"1B","1B","1B","-","-","Acute toxicity – category 4",null,null,"1B"]
[null,null,133,"Chlorpyrifos (Dursban)","2921-88-2",null,0.2,null,null,null,null,null,4,4,"4","-","Sk","Acute toxicity – category 3",null,"Cholinesterase inhib; skin notation",2]
[null,null,134,"Chromium (II) compounds (as Cr)",null,null,0.5,null,null,null,null,null,3,3,null,"-","-","-",null,"(NIOSH Pocket Guide - eye irr; sensitisation dermatitis)"]
[null,null,135,"Chromium (III) compounds (as Cr)",null,null,0.5,null,null,null,null,null,3,3,"3","-","-","-",null,"URT & skin irr",3]
[null,null,136,"Chromium (metal)","7440-47-3",null,0.5,null,null,null,null,null,3,3,"3","-","-","-",null,"URT & skin irr",3]
[null,null,137,"Chromium (VI) compounds (as Cr), certain water insoluble ",null,null,0.05,null,null,null,null,null,3,4,"3","Carc. 1A","Sen","Carcinogenicity – category 1A\nAcute toxicity – category 3\nAcute toxicity – category 1\nSkin corrosion – category 1\nSTOT (repeated exposure) – category 1\nRespiratory sensitisation – category 1\nSkin sensitisation – category 1","Has acute as well as long term health effects. \nPlasma clearance occurs over hours and for tissues several days (ATSDR) - implies it meets or at least approaches the acute criteria.","Lung cancer",3,"Y"]
[null,null,138,"Chromium (VI) compounds (as Cr), water soluble",null,null,0.05,null,null,null,null,null,3,3,"3","-","Sen ","Carcinogenicity – category 1B\nSkin sensitisation – category 1",null,"URT irr; cancer",3]
[null,null,139,"Clopidol (Coyden)","2971-90-6",null,10,null,null,null,null,null,"1C","1C","1C","-","- ","- ",null,"Mutagenic effect","1C"]
[null,null,140,"Coal dust (containing < 5% quartz) (respirable dust)",null,null,3,null,null,null,null,null,3,3,"3","-","- ","- ",null,"Lung damage; pulmonary fibrosis",3]
[null,null,141,"Coal tar pitch volatiles (as benzene solubles)","65996-93-2",null,0.2,null,null,null,null,null,3,3,"3","Carc. 1B","-","Carcinogenicity – category 1A\nGerm cell mutagenicity – category 1B\nReproductive toxicity – category 1B\nSkin sensitisation – category 1",null,"Cancer",3]
[null,null,142,"Cobalt carbonyl (as Co)","10210-68-1",null,0.1,null,null,null,null,null,2,2,"2","-","Sen","-",null,"Pulmonary oedema; spleen damage",4]
[null,null,143,"Cobalt hydrocarbonyl (as Co)","16842-03-8",null,0.1,null,null,null,null,null,2,2,"2","-","Sen","-",null,"Pulmonary oedema; lung damage",4]
[null,null,144,"Cobalt, metal dust & fume (as Co) ","7440-48-4",null,0.05,null,null,null,null,null,3,4,"3","-","Sen","Acute toxicity – category 4\nAcute toxicity – category 1\nCarcinogenicity – category 1B\nSTOT (single exposure) – category 3\nSTOT (repeated exposure) – category 2\nReproductive toxicity – category 1B\nRespiratory sensitisation – category 1\nSkin sensitisation – category 1","Has acute as well as long term-health effects.","Asthma; pulmonary function; myocardial effect",4,"Y"]
[null,null,145,"Copper (fume)","7440-50-8",null,0.2,null,null,null,null,null,2,2,"2","-","-","-",null,"Irr; GI; metal fume fever",4]
[null,null,146,"Copper, dusts & mists (as Cu)","7440-50-8",null,1,null,null,null,null,null,2,2,"1B","-","-","-",null,"Irr; GI; (metal fume fever)",4]
[null,null,147,"Cotton dust, raw ",null,null,0.2,null,null,null,null,null,3,3,"3","-","-","-",null,"Byccinosis; bronchitis; pulmonary function",4]
[null,null,148,"Cresol, all isomers","1319-77-3",5,22,null,null,null,null,null,"1B","1B","1B","-","Sk","Acute toxicity – category 3\nSkin corrosion – category 1A",null,"URT irr",3]
[null,null,149,"Cristobalite (respirable dust)","14464-46-1",null,0.1,null,null,null,null,null,3,3,"3","-","-","Carcinogenicity – category 1A\nSTOT (repeated exposure) – category 1",null,"Pulm fibrosis; lung cancer",3]
[null,null,150,"Crotonaldehyde (trans-But-2-enal)","4170-30-3",2,5.7,null,null,null,null,null,"1B",4,"1B",null,"-","Acute toxicity – category 1\nAcute toxicity – category 3\nSkin irritation – category 2\nEye damage – category 1\nGerm cell mutagenicity – category 1B\nSTOT (single exposure) – category 3\nSTOT (repeated exposure) – category 2","Has acute as well as long term-health effects. Consider 4 by analogy with formaldehyde.","Eye & URT irr (analagous to formaldahyde); skin notation","1A","Y"]
[null,null,151,"Crufomate","299-86-5",null,5,null,null,null,null,null,4,4,"4","-","-","Acute toxicity – category 4",null,null,4]
[null,null,152,"Cumene (Isopropyl benzene)","98-82-8",25,125,null,75,375,null,null,2,4,"2","-","Sk","Carcinogenicity – category 1B\nSTOT (single exposure) – category 3","Has acute as well as long term-health effects.","Eye, skin & URT irr; CNS impairment",2,"Y"]
[null,null,153,"Cyanamide","420-04-2",null,2,null,null,null,null,null,4,4,"1B","-","Sen","Acute toxicity – category 3\nAcute toxicity – category 4\nEye irritation – category 2\nSkin irritation – category 2\nSkin sensitisation – category 1",null,"Skin & eye irr",4]
[null,null,154,"Cyanides (as CN)","151-50-8",null,5,null,null,null,null,null,2,2,"1A","-","Sk","Acute toxicity – category 1\nAcute toxicity – category 2\nSkin irritation – category 2",null,"URT irr; headache; nausea; thyroid effects",4]
[null,null,155,"Cyanogen (Oxalonitrile)","460-19-5",10,21,null,null,null,null,null,"1B","1B","1B","-","- ","Acute toxicity – category 3",null,"Eye & URT irr; ceiling value assigned",4]
[null,null,156,"Cyanogen chloride","506-77-4",null,null,null,null,null,0.3,0.75,"1A","1A","1A","-","- ","- ",null,"Pulmonary oedema; URT, eye & skin irr; ceiling value assigned","1A"]
[null,null,157,"Cyclohexane","110-82-7",100,350,null,300,1050,null,null,2,2,"1B","-","- ","Skin irritation – category 2\nSTOT (single exposure) – category 3",null,"CNS impairment","1B"]
[null,null,158,"Cyclohexanol","108-93-0",50,206,null,null,null,null,null,4,4,"4","-","Sk","Acute toxicity – category 4\nSTOT (single exposure) – category 3\nSkin irritation – category 2 ",null,"Eye irr; CNS impairment",3]
[null,null,159,"Cyclohexanone (Anone)","108-94-1",25,100,null,null,null,null,null,3,3,"3","-","Sk","Acute toxicity – category 4",null,"Eye & URT irr",3]
[null,null,160,"Cyclohexene","110-83-8",300,1010,null,null,null,null,null,"1B","1B","1B","-","-","-",null,"URT & eye irr","1B"]
[null,null,161,"Cyclohexylamine (Aminocyclohexane)","108-91-8",10,41,null,null,null,null,null,"1B","1B","1B",null,"-","Acute toxicity – category 3\nAcute toxicity – category 4\nSkin corrosion – category 1B\nReproductive toxicity – category 2",null,"URT & eye irr","1B"]
[null,null,162,"Cyclonite (Hexahydro-1,3,5-trinitro-1,3,5-triazine, RDX)","121-82-4",null,1.5,null,null,null,null,null,3,3,"3","-","Sk","-",null,"Liver damage",4]
[null,null,163,"Cyclopentadiene","542-92-7",75,203,null,null,null,null,null,"1B","1B","1B","-","-","-",null,"URT & eye irr","1B"]
[null,null,164,"Cyclopentane","287-92-3",600,1720,null,null,null,null,null,4,4,"4","-","-","-",null,"URT, eye & skin irr; CNS impairment",2]
[null,null,165,"Cyhexatin (Tricyclohexyltin hydroxide, Plictran)","13121-70-5",null,5,null,null,null,null,null,"1C","1C","1C","-","-","Acute toxicity – category 4",null,"URT irr; body weight effect; kidney damage","1B"]
[null,null,166,"2,4-D (2,4-Dichlorophenoxyacetic acid)","94-75-7",null,10,null,null,null,null,null,3,3,"3","-","Sen","Acute toxicity – category 4\nSTOT (single exposure) – category 3\nEye damage – category 1\nSkin sensitisation – category 1",null,"Thyroid effect; kidney tubular damage","1C"]
[null,null,167,"DDT (Dichlorodiphenyl-trichloroethane)","50-29-3",null,1,null,null,null,null,null,4,4,"4","Carc. 2","-","Carcinogenicity – category 2\nAcute toxicity – category 3\nSTOT (repeated exposure) – category 1",null,"Liver damage",4]
[null,null,168,"Decaborane","17702-41-9",0.05,0.25,null,0.15,0.75,null,null,4,4,"4","-","Sk",null,null,"CNS convulsions; cognitive decrement",4]
[null,null,169,"Demeton (Systox)","8065-48-3",0.01,0.11,null,null,null,null,null,4,4,"4","-","Sk","Acute toxicity – category 1\nAcute toxicity – category 2",null,"Cholinesterase inhibition; skin notation",4]
[null,null,170,"Diacetone alcohol (4-Hydroxy-4-methyl-2-pentanone)","123-42-2",50,238,null,null,null,null,null,"1B","1B","1B","-","-","Eye irritation – category 2A",null,"URT & eye irr","1B"]
[null,null,171,"Diatomaceous earth (uncalcined) ","61790-53-2",null,10,null,null,null,null,null,"1C","1C","1C","-","-","-",null,null,3]
[null,null,172,"Diazinon","333-41-5",null,0.1,null,null,null,null,null,4,4,"4","-","Sk","Acute toxicity – category 4",null,null,4]
[null,null,173,"Diazomethane","334-88-3",0.2,0.34,null,null,null,null,null,4,4,"4","Carc. 1B","-","Carcinogenicity – category 1B",null,null,4]
[null,null,174,"Diborane","19287-45-7",0.1,0.11,null,null,null,null,null,4,4,"4","-","-","-",null,null,4]
[null,null,175,"Dibutyl phenyl phosphate","2528-36-1",0.3,3.5,null,null,null,null,null,4,4,"4","-","Sk","-",null,null,4]
[null,null,176,"Dibutyl phosphate (Dibutyl hydrogen phosphate)","107-66-4",1,8.6,null,2,17,null,null,"1B","1B","1B","-","- ","-",null,null,"1B"]
[null,null,177,"Dibutyl phthalate","84-74-2",null,5,null,null,null,null,null,4,4,"1B","Repr. 1B","-","Reproductive toxicity – category 1B",null,"Testicular damage; eye & URT irr",4]
[null,null,178,"2-N-Dibutylaminoethanol (N,N-Di-n-butylaminoethanol)","102-81-8",2,14,null,null,null,null,null,3,3,"3","-","Sk","-",null,null,3]
[null,null,179,"1,1-Dichloro-1-nitroethane","594-72-9",2,12,null,null,null,null,null,2,2,"2","-","-","Acute toxicity – category 3",null,"URT irr (bronchitis & pulmonary oedema secondarily protected)","1B"]
[null,null,180,"1,3-Dichloro-5,5-dimethyl hydantoin","118-52-5",null,0.2,null,null,0.4,null,null,"1B","1B","1B","-","-","-",null,"URT irr",4]
[null,null,181,"Dichloroacetylene","7572-29-4",null,null,null,null,null,0.1,0.39,"1A","1A","1A","Carc. 2","-","Carcinogenicity – category 2\nSTOT (repeated exposure) – category 2","Should be changed to Cat 4 based on GHS chronic health and acute toxicity, but there is no TWA WES.  It is an irritant with only a peak / ceiling value, hence remains Cat 1A.","Nausea; PNS impair (liver)","1A","M"]
[null,null,182,"o-Dichlorobenzene (1,2-dichlorobenzene)","95-50-1",25,150,null,50,301,null,null,"1B","1B","1A","-","-","Acute toxicity – category 4\nEye irritation – category 2\nSTOT (single exposure) – category 3\nSkin irritation – category 2","Possibly a Cat 2 given GHS STOT hazard category.","URT & eye irr; liver damage (in rats)",4,"M"]
[null,null,183,"p-Dichlorobenzene (1,4-dichlorobenzene)","106-46-7",25,150,null,50,300,null,null,3,3,"3","Carc. 2","-","Carcinogenicity – category 2\nEye irritation – category 2",null,"Eye irr; kidney damage",3]
[null,null,184,"Dichlorodifluoromethane (Fluorocarbon 12, Freon 12)","75-71-8",1000,4950,null,null,null,null,null,"1C","1C","1C","-","-","-",null,"Cardiac sensitisation",2]
[null,null,185,"1,1-Dichloroethane (Ethylidene chloride)","75-34-3",100,412,null,null,null,null,null,4,4,"4","-","Sk","Acute toxicity – category 4\nEye irritation – category 2A\nSTOT (single exposure) – category 3",null,null,4]
[null,null,186,"Dichloroethyl ether (bis-(2-Chloroethyl)-ether)","111-44-4",5,29,null,10,58,null,null,2,4,"2","Carc. 2","Sk","Acute toxicity – category 1\nCarcinogenicity – category 2","Has health effects after both short and long term exposure.","URT & eye irr; nausea","1A","Y"]
[null,null,187,"1,2-Dichloroethylene (Acetylene dichloride)","540-59-0",200,793,null,null,null,null,null,4,4,"4","-","-","Acute toxicity – category 4",null,null,4]
[null,null,188,"Dichlorofluoromethane (Fluorocarbon 21, Freon 21)","75-43-4",10,42,null,null,null,null,null,3,3,"4","-","-","-",null,"Liver damage",3]
[null,null,189,"Dichloropropene (gamma-Chloroallyl chloride, 1,3-dichloropropene)","542-75-6",1,4.5,null,null,null,null,null,4,4,"4",null,"Sk:Sen","Acute toxicity – category 3\nAcute toxicity – category 4\nEye irritation – category 2\nSTOT (single exposure) – category 3\nSkin irritation – category 2\nSkin sensitisation – category 1 E",null,"Kidney damage","1B"]
[null,null,190,"2,2-Dichloropropionic acid (Dalapon)","75-99-0",1,5.8,null,null,null,null,null,"1B","1B","1B","-","-","Skin irritation – category 2\nEye damage – category 1",null,"Eye & URT irr","1B"]
[null,null,191,"Dichlorotetrafluoroethane (Fluorocarbon 114, Freon 114, R-114, Tetrafluoro dichloroethane)","76-14-2",1000,6990,null,null,null,null,null,"1C","1C",null,"-","-","-",null,"Pulmonary function","1C"]
[null,null,192,"Dichlorvos (DDVP)","62-73-7",0.1,0.9,null,null,null,null,null,4,4,"4","-","Sk:Sen","Acute toxicity – category 2\nAcute toxicity – category 3\nSkin sensitisation – category 1",null,"Cholinesterase inhib; skin notation & sensitiser",4]
[null,null,193,"Dicrotophos (Bidrin)","141-66-2",null,0.25,null,null,null,null,null,4,4,"4","-","Sk","Acute toxicity – category 2\nAcute toxicity – category 3",null,"Cholinesterase inhib; skin notation",2]
[null,null,194,"Dicyclopentadiene (3a,4,7,7a-tetrahydro-4,7-methanoindene)","77-73-6",5,27,null,null,null,null,null,3,3,"3","-","-","Acute toxicity – category 4\nEye irritation – category 2\nSkin irritation – category 2\nSTOT (single exposure) – category 3 ",null,"URT, LRT & eye irr",3]
[null,null,195,"Dicyclopentadienyl iron (Ferrocene)","102-54-5",null,10,null,null,null,null,null,"1C","1C","1C","-","-","-",null,"Liver damage","1C"]
[null,null,196,"Dieldrin","60-57-1",null,0.25,null,null,null,null,null,4,4,"4","Carc. 2","Sk","Carcinogenicity – category 2\nAcute toxicity – category 1\nAcute toxicity – category 3\nSTOT (repeated exposure) – category 1",null,"Liver damage; repro effect; CNS impairment",4]
[null,null,197,"Diethanolamine (2,2'-Iminodiethanol)","111-42-2",3,13,null,null,null,null,null,4,4,"1B","-","- ","Acute toxicity – category 4\nEye damage – category 1\nSkin irritation – category 2\nSTOT (single exposure) – category 3\nSTOT (repeated exposure) – category 2",null,"Liver & kidney damage (also irritative effects)",4]
[null,null,198,"Diethyl ketone (3-Pentanone)","96-22-0",200,705,null,null,null,null,null,2,2,"2","-","- ","STOT (single exposure) – category 3",null,null,2]
[null,null,199,"Diethyl phthalate","84-66-2",null,5,null,null,null,null,null,"1B","1B","3","-","- ","-",null,"URT irr","1B"]
[null,null,200,"Diethylamine ","109-89-7",10,30,null,25,75,null,null,"1B","1B","1B","-","- ","Acute toxicity – category 4\nSkin corrosion – category 1A",null,"URT & eye irr; skin notation","1B"]
[null,null,201,"2-Diethylaminoethanol ","100-37-8",10,48,null,null,null,null,null,"1B",2,"1B","-","Sk ","Acute toxicity – category 3\nAcute toxicity – category 4\nSkin corrosion – category 1","Is an irritant, but does have acute (CNS) effects (ACGIH).","URT irr; CNS convulsions; skin notation",3,"Y"]
[null,null,202,"Diethylene triamine (2,2'-Diaminodiethylamine, 1,4,7-Tri-(aza)-heptane)","111-40-0",1,4.2,null,null,null,null,null,4,4,"3","-","Sk:Sen","Acute toxicity – category 4\nAcute toxicity – category 2\nSkin corrosion – category 1A\nSkin sensitisation – category 1",null,"URT & eye irr; skin notation","1B"]
[null,null,203,"Difluorodibromomethane (Dibromodifluoromethane)","75-61-6",100,858,null,null,null,null,null,4,4,"4","-","-","-",null,null,4]
[null,null,204,"Diglycidyl ether (DGE, bis(2,3-Epoxy propyl) ether)","2238-07-5",0.1,0.53,null,null,null,null,null,3,3,"3","-","-","-",null,"Eye & skin irr; male repro damage",4]
[null,null,205,"Diisobutyl ketone (2,6-Dimethyl-4-heptanone)","108-83-8",25,145,null,null,null,null,null,"1B","1B","1B","-","-","STOT (single exposure) – category 3",null,null,"1B"]
[null,null,206,"Diisopropylamine","108-18-9",5,21,null,null,null,null,null,"1B","1B","1B","-","Sk","Acute toxicity – category 4\nSkin corrosion – category 1B",null,null,"1B"]
[null,null,207,"Dimethyl acetamide","127-19-5",10,36,null,null,null,null,null,4,4,"4","-","Sk","Acute toxicity – category 4\nSTOT (repeated exposure) – category 2\nReproductive toxicity – category 1B",null,null,4]
[null,null,208,"Dimethyl ether","115-10-6",400,760,null,500,950,null,null,"1B","1B",null,"-","-",null,null,"(SCOEL documentation - low toxicity; CNS effects at high concentrations)"]
[null,null,209,"Dimethyl sulphate","77-78-1",0.1,0.52,null,null,null,null,null,4,4,"3","Carc. 1B","Sk:Sen","Carcinogenicity – category 1B\nGerm cell mutagenicity – category 2\nAcute toxicity – category 1\nAcute toxicity – category 3\nSkin sensitisation – category 1\nSkin corrosion – category 1B",null,"Eye & skin irr; skin notation","1B"]
[null,null,210,"Dimethylamine","124-40-3",2,3.8,null,6,11,null,null,"1B","1B","1B","-","-","Acute toxicity – category 4\nSTOT (single exposure) – category 3\nSkin irritation – category 2\nEye damage – category 1","Could move to 2 as it has acute toxicity, however acute toxicity is Cat 4 - harmful only.","URT & GI irr","1B","M"]
[null,null,211,"Dimethylaminoethanol","108-01-0",2,7.4,null,6,22,null,null,"1B","1B",null,"-","-","Acute toxicity – category 4\nSkin sensitisation – category 1\nSkin corrosion – category 1","Could move to 2 as it has acute toxicity, however acute toxicity is Cat 4 - harmful only.","(UK HSE documentation - Eye & URT irr)",null,"M"]
[null,null,212,"N,N-Dimethylaniline","121-69-7",5,25,null,10,50,null,null,4,4,"4","Carc. 2","Sk","Acute toxicity – category 3\nCarcinogenicity – category 2\nSTOT (repeated exposure) – category 2",null,null,4]
[null,null,213,"N,N-Dimethylethylamine (ethyldimethylamine)","598-56-1",10,30,null,15,45,null,null,4,4,null,"-","-","Acute toxicity – category 4\nSkin corrosion – category 1B",null,"(UK HSE documentation - reversible visual disturbance / visual impairment; URT irr)"]
[null,null,214,"Dimethylformamide","68-12-2",10,30,null,null,null,null,null,3,3,"3",null,"Sk","Reproductive toxicity – category 1B\nAcute toxicity – category 4\nEye irritation – category 2A",null,null,3]
[null,null,215,"1,1-Dimethylhydrazine","57-14-7",0.01,2.5000000000000001E-2,null,null,null,null,null,3,3,"3","Carc. 1B","Sk","Acute toxicity – category 3\nAcute toxicity – category 4\nAcute toxicity – category 2\nCarcinogenicity – category 1B\nGerm cell mutagenicity – category 2\nSkin corrosion – category 1B",null,null,3]
[null,null,216,"Dimethylphthalate","131-11-3",null,5,null,null,null,null,null,"1B","1B","1B","-","-","-",null,"Eye & URT irr","1C"]
[null,null,217,"Dinitolmide (3,5-Dinitro-o-toluamide, Zoalene)","148-01-6",null,5,null,null,null,null,null,3,3,"3","-","-","-",null,null,3]
[null,null,218,"m-Dinitrobenzene (1,3-dinitrobenzene)","99-65-0",0.15,1,null,null,null,null,null,4,4,"4","-","Sk","Acute toxicity – category 1\nAcute toxicity – category 2\nSTOT (repeated exposure) – category 2",null,"MeHb-emia; eye damage; skin notation",4]
[null,null,219,"o-Dinitrobenzene (1,2-dinitrobenzene)","528-29-0",0.15,1,null,null,null,null,null,4,4,4,"-","Sk","Acute toxicity – category 1\nAcute toxicity – category 2\nSTOT (repeated exposure) – category 2",null,"MeHb-emia; eye damage; skin notation",4]
[null,null,220,"p-Dinitrobenzene (1,4-dinitrobenzene)","100-25-4",0.15,1,null,null,null,null,null,4,4,"4","-","Sk","Acute toxicity – category 1\nAcute toxicity – category 2\nSTOT (repeated exposure) – category 2",null,"MeHb-emia; eye damage; skin notation",4]
[null,null,221,"Dinitro-o-cresol (DNOC, 2-Methyl-4,6-dinitrophenol)","534-52-1",null,0.2,null,null,null,null,null,3,3,"3",null,"Sk:Sen","Germ cell mutagenicity – category 2\nAcute toxicity – category 1\nAcute toxicity – category 2\nEye damage – category 1\nSkin sensitisation – category 1\nSkin irritation – category 2",null,null,3]
[null,null,222,"Dinitrotoluene ","25321-14-6",null,1.5,null,null,null,null,null,4,4,"4","Carc. 1B","Sk","STOT (single exposure) – category 1\nCarcinogenicity – category 1B\nGerm cell mutagenicity – category 2\nSTOT (repeated exposure) – category 2\nReproductive toxicity – category 2",null,null,4]
[null,null,223,"1,4-Dioxane (Diethylene dioxide)","123-91-1",10,36,null,null,null,null,null,3,3,"3","Carc. 2","Sk","Carcinogenicity – category 2\nEye irritation – category 2\nSTOT (single exposure) – category 3",null,"Liver damage",4]
[null,null,224,"Dioxathion (Delnav)","78-34-2",null,0.2,null,null,null,null,null,4,4,"3","-","Sk","Acute toxicity – category 2\nAcute toxicity – category 3",null,"Cholinesterase inhib; skin notation",4]
[null,null,225,"Diphenylamine","122-39-4",null,10,null,null,null,null,null,4,4,"4","-","-","Acute toxicity – category 3\nSTOT (repeated exposure) – category 2",null,null,4]
[null,null,226,"Dipropyl ketone (4-Heptanone)","123-19-3",50,233,null,null,null,null,null,"1B","1B",null,"-","-","Acute toxicity – category 4",null,"URT irr (ACGIH 2011 documentation - Eye, skin & URT irr; narcosis; marginal liver effects at > 1000 ppm)",4]
[null,null,227,"Diquat (Diquat dibromide (ISO))","85-00-7",null,0.5,null,null,null,null,null,3,3,"3","-","Sen","Acute toxicity – category 2\nSTOT (repeated exposure) – category 1\nAcute toxicity – category 4\nEye irritation – category 2\nSkin irritation – category 2\nSkin sensitisation – category 1\nSTOT (single exposure) – category 3",null,null,3]
[null,null,228,"Di-sec-octyl phthalate (DOP, Di (2-ethylhexyl) phthalate, bis(2-Ethylhexyl) phthalate)","117-81-7",null,5,null,null,10,null,null,3,3,"3","-","- ","Carcinogenicity – category 1B\nReproductive toxicity – category 1B",null,"(NIOSH Int Chem Safety Cards - eye & URT irr; male repro effects)","1B"]
[null,null,229,"Disulfiram (Tetraethyl thiuram disulphide)","97-77-8",null,2,null,null,null,null,null,2,4,"2","-","Sen","Acute toxicity – category 4\nSkin sensitisation – category 1\nGerm cell mutagenicity – category 2\nSTOT (repeated exposure) – category 2","Has health effects after both short and long term exposure.","Vasodilation; nausea",4,"Y"]
[null,null,230,"Disulfoton (Disyston)","298-04-4",null,0.1,null,null,null,null,null,4,4,"4","-","-","Acute toxicity – category 1\nAcute toxicity – category 2",null,"Cholinesterase inhibitor; skin notation",4]
[null,null,231,"2,6-Di-tert-butyl-p-cresol","128-37-0",null,10,null,null,null,null,null,"1C","1C","1C","-","-","-",null,null,"1B"]
[null,null,232,"Diuron","330-54-1",null,10,null,null,null,null,null,"1C",4,"1C","Carc. 2","-","Carcinogenicity – category 2\nAcute toxicity – category 4\nSTOT (repeated exposure) – category 2","Has health effects after both short and long term exposure.","URT irr","1C","Y"]
[null,null,233,"Divinyl benzene","1321-74-0",10,53,null,null,null,null,null,"1B","1B","1B","-","-","-",null,null,"1B"]
[null,null,234,"Emery (dust) ","1302-74-5",null,10,null,null,null,null,null,"1C","1C","1C","-","-","-",null,null,"1C"]
[null,null,235,"Endosulfan (Thiodan)","115-29-7",null,0.1,null,null,null,null,null,4,2,"4","-","Sk","Acute toxicity – category 2\nAcute toxicity – category 4","Should be Cat 2 as it appears to have only acute toxicity.","LRT irr; liver & kidney damage; skin notation",4,"Y"]
[null,null,236,"Endrin","72-20-8",null,0.1,null,null,null,null,null,2,2,"2","-","Sk","Acute toxicity – category 2\nAcute toxicity – category 3","Effects are acute only.","Liver damage; CNS impairment; headache; skin notation",4]
[null,null,237,"Enflurane (2-Chloro-1,1,2-trifluoroethyl difluoromethyl ether)","13838-16-9",0.5,3.8,null,null,null,null,null,2,2,"2","-","-","-",null,"CNS impairment; cardiac impairment",4]
[null,null,238,"Epichlorohydrin (1-Chloro-2,3-epoxy-propane; Oxirane, (chloromethyl)-)","106-89-8",2,7.6,null,null,null,null,null,4,4,"4","Carc. 1B","Sk:Sen","Acute toxicity – category 3\nGerm cell mutagenicity – category 1B\nSTOT (single exposure) – category 3\nSkin corrosion – category 1\nSkin sensitisation – category 1\nCarcinogenicity – category 1B\nReproductive toxicity – category 2",null,null,4]
[null,null,239,"EPN (O-Ethyl-O-(4-nitrophenyl) phenylthiophosphonate)","2104-64-5",null,0.5,null,null,null,null,null,4,4,"4","-","Sk","Acute toxicity – category 1\nAcute toxicity – category 2","Could move to 2 as it appears to have only acute toxicity.","Cholinesterase inhibition; skin notation",4,"?"]
[null,null,240,"Ethanolamine (2-Aminoethanol)","141-43-5",3,7.5,null,6,15,null,null,3,3,"3","-","-","Acute toxicity – category 4\nSkin corrosion – category 1B","Could move to 2 as it appears to have only acute toxicity.","Eye & skin irr",3,"?"]
[null,null,241,"Ethion (Nialate)","563-12-2",null,0.4,null,null,null,null,null,4,4,"4","-","Sk","Acute toxicity – category 3\nAcute toxicity – category 4","Could move to 2 as it appears to have only acute toxicity.","Cholinesterase inhibition; skin notation",4,"?"]
[null,null,242,"2-Ethoxyethanol (Cellosolve; Ethyl glycol; Ethylene glycol, monoethyl ether; Glycol, monoethyl ether)","110-80-5",5,18,null,null,null,null,null,4,4,"4","-","Sk","Reproductive toxicity – category 1B\nAcute toxicity (inhalation) - category 4\nAcute toxicity (ingestion) - category 4",null,"Male repro damage; embryo/foetal damage",4]
[null,null,243,"2-Ethoxyethyl acetate (Cellosolve acetate; Glycol, monoethyl ether acetate; Ethylene glycol, monoethyl ether acetate; Ethyl glycol acetate)","111-15-9",5,27,null,null,null,null,null,4,4,"4","-","Sk","Reproductive toxicity – category 1B\nAcute toxicity (inhalation) - category 4\nAcute toxicity (ingestion) - category 4",null,null,4]
[null,null,244,"Ethyl acetate (Acetic acid ethyl ester, Acetic ester)","141-78-6",200,720,null,400,1440,null,null,"1B","1B","1B","-","-","STOT (single exposure) – category 3\nEye irritation – category 2A","Could move to 2 as it has acute toxicity, however acute toxicity is mild and is of low toxicity.","URT & eye irr","1B","?"]
[null,null,245,"Ethyl acrylate (Acrylic acid,ethyl ester)","140-88-5",null,null,null,null,null,5,20,4,"1A","3","-","Sen","Acute toxicity – category 4\nAcute toxicity – category 3\nEye irritation – category 2A\nSkin irritation – category 2\nSTOT (single exposure) – category 3\nSkin sensitisation – category 1","Should be Cat 4 based on GHS chronic health and acute toxicity, but there is no TWA WES.  It is an irritant with only a peak / ceiling value, hence must be classified as Cat 1A.","URT, eye & GI irr; CNS impair; skin sens",4,"Y"]
[null,null,246,"Ethyl alcohol (Ethanol)","64-17-5",1000,1880,null,null,null,null,null,"1B","1B","1B","-","- ","Eye irritation – category 2A",null,null,"1B"]
[null,null,247,"Ethyl benzene","100-41-4",100,434,null,125,543,null,null,4,4,"3","-","- ","Acute toxicity – category 4\nEye irritation – category 2A\nSkin irritation – category 2","Cat 4 looks appropriate based on ACGIH doco that does indicate potential chronic effects (CNS, liver, kidneys) - although its animal studies. But is an irritant","URT irr; kidney damage (nephropathy); cochlear impair",4]
[null,null,248,"Ethyl bromide (Bromoethane)","74-96-4",5,22,null,null,null,null,null,4,4,"4","Carc. 2","Sk","Acute toxicity – category 4\nCarcinogenicity – category 2",null,"Liver damage; CNS impairment",3]
[null,null,249,"Ethyl butyl ketone (3-Heptanone)","106-35-4",50,234,null,null,null,null,null,2,2,"2","-","-","Acute toxicity – category 4\nEye irritation – category 2",null,null,2]
[null,null,250,"Ethyl chloride (Chloroethane)","75-00-3",1000,2640,null,null,null,null,null,4,4,"4","Carc. 2","-","Carcinogenicity – category 2",null,null,3]
[null,null,251,"Ethyl ether (Diethyl ether)","60-29-7",400,1210,null,500,1520,null,null,"1B","1B","1B","-","-","Acute toxicity – category 4\nSTOT (single exposure) – category 3",null,"CNS impairment; URT irr",2]
[null,null,252,"Ethyl formate (Formic acid, ethyl ester)","109-94-4",100,303,null,null,null,null,null,"1B","1B","1B","-","-","Acute toxicity – category 4\nEye irritation – category 2\nSTOT (single exposure) – category 3",null,null,"1B"]
[null,null,253,"Ethyl mercaptan (Ethanethiol)","75-08-1",0.5,1.3,null,null,null,null,null,"1B","1B","1B","-","-","Acute toxicity – category 4",null,null,"1B"]
[null,null,254,"Ethyl silicate (Tetraethyl orthosilicate)","78-10-4",10,85,null,null,null,null,null,3,3,"3","-","-","Acute toxicity – category 4\nEye irritation – category 2\nSTOT (single exposure) – category 3",null,null,3]
[null,null,255,"Ethylamine","75-04-7",2,3.8,null,6,11,null,null,"1B","1B","1B","-","-","Eye irritation – category 2\nSTOT (single exposure) – category 3","Possibly a Cat 2 given GHS STOT hazard category.","URT irr","1B","M"]
[null,null,256,"Ethylene chlorohydrin (2-Chloroethanol)","107-07-3",null,null,null,null,null,1,3.3,"1A","1A","1A","-","Sk","Acute toxicity – category 1\nAcute toxicity – category 2",null,"CNS impairment; liver & kidney damage","1A"]
[null,null,257,"Ethylene dichloride (1,2-Dichloroethane)","107-06-2",10,40,null,null,null,null,null,3,4,"3","Carc. 1B","-","Acute toxicity – category 4\nAcute toxicity – category 3\nCarcinogenicity – category 1B\nEye irritation – category 2A\nSkin irritation – category 2\nSTOT (single exposure) – category 3\nGerm cell mutagenicity – category 2","Should be Cat 4 based on acute and chronic effects","Liver damage; nausea",4,"Y"]
[null,null,258,"Ethylene glycol (particulate) (Ethane-1,2-diol)","107-21-1",null,10,null,null,null,null,null,"1B",2,"1A","-","Sk","Acute toxicity – category 4\nSTOT (single exposure) – category 3","Should be Cat 2 given GHS STOT hazard category.","URT & eye irr","1A","Y"]
[null,null,259,"Ethylene glycol (vapour) (Ethane-1,2-diol)","107-21-1",20,52,null,40,104,null,null,"1B",2,"1A","-","Sk","Acute toxicity – category 4\nSTOT (single exposure) – category 3","Could be 1A based on ACGIH assigning peak, but also could argue Cat 2 as ingestion can cause acute effects (ACGIH)","URT & eye irr (headaches, vasodilation?)","1A","Y"]
[null,null,260,"Ethylene glycol dinitrate (EGDN, Ethylene dinitrate, Glycol dinitrate, Nitroglycol)","628-96-6",0.05,0.31,null,null,null,null,null,2,4,"1A","-","Sk","Acute toxicity – category 1\nAcute toxicity – category 2\nSTOT (repeated exposure) – category 2","Is a Cat 4 given GHS STOT hazard categories.  Also, ACGIH TLV is based on analogy with propylene glycol dinitrate, which is Cat 4.","Vasodilation; headache; skin notation",4,"Y"]
[null,null,261,"Ethylene oxide (Oxirane)","75-21-8",1,1.8,null,null,null,null,null,3,3,"3","Carc. 1B","-","Acute toxicity – category 4\nAcute toxicity – category 3\nCarcinogenicity – category 1B\nGerm cell mutagenicity – category 1B\nSkin corrosion – category 1B\nSTOT (repeated exposure) – category 1\nSkin sensitisation – category 1",null,"Cancer; CNS impairment",4]
[null,null,262,"Ethylenediamine (1,2-Diaminoethane)","107-15-3",10,25,null,null,null,null,null,3,3,"3","-","Sen","Acute toxicity – category 4\nSkin corrosion – category 1B\nSkin sensitisation – category 1\nRespiratory sensitisation – category 1",null,null,3]
[null,null,263,"Ethylenimine (Aziridine)","151-56-4",0.5,0.88,null,null,null,null,null,4,4,null,"Carc. 1B","Sk","Acute toxicity – category 2\nAcute toxicity – category 1\nCarcinogenicity – category 1B\nGerm cell mutagenicity – category 1B\nSkin corrosion – category 1C",null,null,4]
[null,null,264,"Ethylidene norbornene","16219-75-3",null,null,null,null,null,5,25,"1A","1A","1A","-","-","-",null,"URT & eye irr","1A"]
[null,null,265,"N-Ethylmorpholine","100-74-3",5,24,null,null,null,null,null,2,2,"2","-","Sk","-",null,"URT irr; eye damage","1B"]
[null,null,266,"Fenamiphos (Nemacur)","22224-92-6",null,0.1,null,null,null,null,null,4,4,"4","-","Sk","Acute toxicity – category 2\nEye irritation – category 2",null,null,4]
[null,null,267,"Fensulfothion (Dasanit)","115-90-2",null,0.1,null,null,null,null,null,4,4,"4","-","-","Acute toxicity – category 1\nAcute toxicity – category 2",null,null,4]
[null,null,268,"Fenthion (Baytex, Lebaycid)","55-38-9",null,0.2,null,null,null,null,null,4,4,"4","-","Sk","Germ cell mutagenicity – category 2\nAcute toxicity – category 3\nAcute toxicity – category 4\nSTOT (repeated exposure) – category 1",null,null,4]
[null,null,269,"Ferbam","14484-64-1",null,10,null,null,null,null,null,3,3,"1B","-","-","Eye irritation – category 2\nSTOT (single exposure) – category 3\nSkin irritation – category 2",null,"CNS impairment; body weight effect; spleen damage","1C"]
[null,null,270,"Ferrovanadium dust","12604-58-9",null,1,null,null,3,null,null,"1B","1B","1B","-","-","-",null,"Eye, URT & LRT irr",3]
[null,null,271,"Fluorides (as F)",null,null,2.5,null,null,null,null,null,3,3,"3","-","-","-",null,"Bone damage; fluorosis",4]
[null,null,272,"Fluorine","7782-41-4",1,1.6,null,2,3.1,null,null,"1B","1B","1B","-","-","Oxidising gas – category 1\nAcute toxicity – category 2\nSkin corrosion – category 1A",null,"URT, eye & skin irr","1B"]
[null,null,273,"Fonofos (Dyfonate)","944-22-9",null,0.1,null,null,null,null,null,4,4,"4","-","Sk","Acute toxicity – category 1\nAcute toxicity – category 2",null,null,4]
[null,null,274,"Formaldehyde ","50-00-0",1,1.2,null,2,2.5,null,null,4,4,"1A","Carc. 2","Sen","Acute toxicity (inhalation) - category 2\nAcute toxicity (ingestion) - category 3\nAcute toxicity (dermal) - category 3\nSkin corrosion – category 1\nSkin sensitisation – category 1\nCarcinogenicity – category 1B",null,"URT & eye irr, but an A2 carcinogen & sensitiser",4]
[null,null,275,"Formamide","75-12-7",10,18,null,null,null,null,null,3,3,"3","-","Sk ","Reproductive toxicity – category 1B\nSTOT (repeated exposure) – category 2",null,null,3]
[null,null,276,"Formic acid","64-18-6",5,9.4,null,10,19,null,null,"1B",2,"1B","-","- ","Acute toxicity – category 4\nAcute toxicity – category 3\nSTOT (single exposure) – category 3\nSkin corrosion – category 1","Is an irritant but also has acute effects (organ damage H331)","URT, skin & eye irr","1B","Y"]
[null,null,277,"Fumed silica (respirable dust)","69012-64-2",null,2,null,null,null,null,null,3,3,3,"-","- ","Carcinogenicity – category 1A\nSTOT (repeated exposure) – category 1"]
[null,null,278,"Furfural (2-Furaldehyde; 2-Furancarboxaldehyde)","98-01-1",2,7.9,null,null,null,null,null,"1B",4,"1B","-","Sk ","Acute toxicity – category 3\nCarcinogenicity – category 2\nSkin irritation – category 2\nSTOT (single exposure) – category 3\nEye irritation – category 2A","Is an irritant, but also has acute and long-term effects (see H classifications).","URT & eye irr","1B","Y"]
[null,null,279,"Furfuryl alcohol","98-00-0",10,40,null,15,60,null,null,"1B",4,"1B","Carc. 2","Sk ","Acute toxicity – category 3\nAcute toxicity – category 4\nEye irritation – category 2A\nSkin sensitisation – category 1\nCarcinogenicity – category 2\nSTOT (single exposure) – category 3\nSTOT (repeated exposure) – category 2","Is an irritant, but also has acute and long-term effects (see H classifications).","URT & eye irr","1B","Y"]
[null,null,280,"Germanium tetrahydride (Germane)","7782-65-2",0.2,0.63,null,null,null,null,null,2,2,"2","-","- ","-",null,"Haematologic effect",4]
[null,null,281,"Glutaraldehyde (1,5-Pentanedial)","111-30-8",null,null,null,null,null,0.1,0.41,4,"1A","1A","-","Sen ","Acute toxicity – category 2\nAcute toxicity – category 3\nSTOT (single exposure) – category 3\nSkin corrosion – category 1B\nRespiratory sensitisation – category 1\nSkin sensitisation – category 1A","Should be Cat 4 based on GHS chronic health and acute toxicity, but there is no TWA WES.  It is an irritant with only a peak / ceiling value, hence must be classified as Cat 1A.","URT, skin & eye irr; CNS impair; sensitiser","1A","Y"]
[null,null,282,"Glycerin mist ","56-81-5",null,10,null,null,null,null,null,"1C","1C","1C","-","- ","-",null,null,"1C"]
[null,null,283,"Glycidol (2,3-Epoxy-1-propanol)","556-52-5",25,76,null,null,null,null,null,4,4,"1B","Carc. 1B","-","Acute toxicity – category 4\nAcute toxicity – category 2\nCarcinogenicity – category 1B\nGerm cell mutagenicity – category 1B\nEye irritation – category 2A\nSkin irritation – category 2\nSTOT (single exposure) – category 3\nReproductive toxicity – category 1B",null,"URT, eye & skin irr; cancer & genotoxicity",3]
[null,null,284,"Grain dust (oats,wheat, barley)",null,null,4,null,null,null,null,null,4,4,"4","-","-","-",null,"Bronchitis; URT irr; pulmonary function",4]
[null,null,285,"Graphite (all forms except fibres) (respirable dust) (natural & synthetic)","7782-42-5",null,3,null,null,null,null,null,3,3,"3","-","-","-",null,"Pneumoconiosis",3]
[null,null,286,"Hafnium","7440-58-6",null,0.5,null,null,null,null,null,3,3,"3","-","-","-",null,"URT & eye irr; liver damage",3]
[null,null,287,"Halothane (1,1,1-Trifluoro-2-chloro-2-bromoethane)","151-67-7",0.5,4.0999999999999996,null,null,null,null,null,4,4,"4","-","-","-",null,"Liver damage; CNS impairment; vasodilation",4]
[null,null,288,"Heptachlor ","76-44-8",null,0.5,null,null,null,null,null,4,4,"4","Carc. 2","Sk","Carcinogenicity – category 2\nAcute toxicity – category 3\nSTOT (repeated exposure) – category 2",null,"Liver damage",4]
[null,null,289,"Heptane (n-Heptane)","142-82-5",400,1640,null,500,2050,null,null,2,2,"2","-","-","Skin irritation – category 2\nSTOT (single exposure) – category 3",null,"CNS impairment; URT irr",2]
[null,null,290,"Hexachlorobutadiene","87-68-3",0.02,0.21,null,null,null,null,null,3,3,"3","-","Sk","-",null,"Kidney damage",3]
[null,null,291,"Hexachlorocyclopentadiene","77-47-4",0.01,0.11,null,null,null,null,null,4,2,"4","-","-","Acute toxicity – category 2\nAcute toxicity – category 3\nAcute toxicity – category 4\nSkin corrosion – category 1B","Should be Cat 2 given GHS hazard category & ACGIH documentation.  There does not appear to be any long-term effects!","URT irr",4,"Y"]
[null,null,292,"Hexachloroethane","67-72-1",1,9.6999999999999993,null,null,null,null,null,3,3,"3","-","-","Carcinogenicity – category 2\nEye irritation – category 2A\nSTOT (repeated exposure) – category 2",null,"Liver & kidney damage; skin notation",3]
[null,null,293,"Hexachloronaphthalene","1335-87-1",null,0.2,null,null,null,null,null,3,3,"3","-","Sk","-",null,"Liver damage; chlorachne; skin notation",3]
[null,null,294,"Hexafluoroacetone","684-16-2",0.1,0.68,null,null,null,null,null,4,4,"4","-","Sk","-",null,"Testicular & kidney damage; skin notation",4]
[null,null,295,"Hexamethylene diisocyanate (HDI)","822-06-0",null,0.02,null,null,7.0000000000000007E-2,null,null,3,4,"3","-","Sen","Acute toxicity – category 3\nEye irritation – category 2\nSTOT (single exposure) – category 3\nSkin irritation – category 2\nSkin sensitisation – category 1\nRespiratory sensitisation – category 1","Is an irritant, but also has acute and long-term effects (see H classifications).","URT irr; respiratory sensitiser",4,"Y"]
[null,null,296,"Hexane (n-Hexane)","110-54-3",20,72,null,null,null,null,null,4,4,"4","-","- ","Skin irritation – category 2\nReproductive toxicity – category 2\nSTOT (single exposure) – category 3\nSTOT (repeated exposure) – category 2",null,"CNS impairment; peripheral neuropothy; eye irr",3]
[null,null,297,"Hexane, other isomers",null,500,1760,null,1000,3500,null,null,"1C","1C","1C","-","- ","-",null,"CNS impairment; URT & eye irr",2]
[null,null,298,"sec-Hexyl acetate (1,3-Dimethyl butyl acetate)","108-84-9",50,295,null,null,null,null,null,"1B","1B","1B","-","- ","-",null,null,"1B"]
[null,null,299,"Hexylene glycol (2-Methylpentane-2,4-diol)","107-41-5",null,null,null,null,null,25,121,"1A","1A","1A","-","- ","Eye irritation – category 2\nSkin irritation – category 2",null,"Eye & URT irr","1A"]
[null,null,300,"Hydrazine (Diamine)","302-01-2",0.01,1.2999999999999999E-2,null,null,null,null,null,3,4,"3","-","Sk;Sen","Acute toxicity – category 3\nGerm cell mutagenicity – category 2\nSkin corrosion – category 1\nSTOT (repeated exposure) – category 1\nSkin sensitisation – category 1\nCarcinogenicity – category 1B","Cat 4 based on acute (H301, 311, 331) as well as chronic (cancer) effects.","URT irr; cancer",4,"Y"]
[null,null,301,"Hydrogen bromide","10035-10-6",null,null,null,null,null,3,9.9,"1A","1A","1A","-","- ","Skin corrosion – category 1A\nSTOT (single exposure) – category 3","Could be changed to Cat 2 based on GHS STOT hazard category, but there is no TWA WES.  It is an irritant with only a peak / ceiling value, hence remains Cat 1A.","URT irr (analogous to HCl)","1A","M"]
[null,null,302,"Hydrogen chloride (Hydrochloric acid)","7647-01-0",null,null,null,null,null,5,7.5,"1A","1A","1A","-","- ","Acute toxicity – category 3\nSkin corrosion – category 1A",null,"URT (& eye) irr","1A"]
[null,null,303,"Hydrogen cyanide (Hydrocyanic acid)","74-90-8",null,null,null,null,null,10,11,"1A","1A","1A","-","Sk ","Acute toxicity – category 2",null,"URT irr; headache; nausea; thryroid eff","1A"]
[null,null,304,"Hydrogen fluoride (as F)","7664-39-3",null,null,null,null,null,3,2.6,"1A","1A","1A","-","- ","Acute toxicity – category 1\nAcute toxicity – category 2\nSkin corrosion – category 1A",null,"URT, LRT, skin & eye irr; fluorosis","1A"]
[null,null,305,"Hydrogen peroxide","7722-84-1",1,1.4,null,null,null,null,null,"1B","1B","1B","-","- ","Acute toxicity – category 4\nSkin corrosion – category 1A\nSTOT (single exposure) – category 3","Possibly a Cat 2 given GHS STOT hazard category.","Eye, URT & skin irr","1B","M"]
[null,null,306,"Hydrogen selenide (as Se)","7783-07-5",0.05,0.16,null,null,null,null,null,4,4,"4","-","- ","-",null,"URT & eye irr; nausea",3]
[null,null,307,"Hydrogen sulphide","7783-06-4",10,14,null,15,21,null,null,"1C","1C","1C","-","- ","Acute toxicity – category 2","Possibly a Cat 2 given GHS hazard category plus low exposure concentration for fatality.","URT irr; CNS impairment",4,"?"]
[null,null,308,"Hydrogenated terphenyls","37275-59-5",0.5,4.9000000000000004,null,null,null,null,null,3,3,"3","-","- ","-",null,null,3]
[null,null,309,"Hydroquinone (p-Dihydroxybenzene)","123-31-9",null,2,null,null,null,null,null,4,4,"4","Carc. 2","-","Acute toxicity – category 4\nCarcinogenicity – category 2\nGerm cell mutagenicity – category 2\nEye damage – category 1\nSkin sensitisation – category 1",null,"Eye irr; eye damage; DSEN notation",4]
[null,null,310,"2-Hydroxypropyl acrylate","999-61-1",0.5,2.8,null,null,null,null,null,4,4,"1B","-","Sk:Sen","Acute toxicity – category 3\nSkin corrosion – category 1B\nSkin sensitisation – category 1",null,"Eye & URT irr; skin notation & sensitiser","1B"]
[null,null,311,"Indene","95-13-6",10,48,null,null,null,null,null,4,4,"1B","-","- ","-",null,"Liver damage",4]
[null,null,312,"Indium & compounds (as In)","7440-74-6",null,0.1,null,null,null,null,null,4,4,"4","-","- ","-",null,null,4]
[null,null,313,"Iodine","7553-56-2",null,null,null,null,null,0.1,1,"1A","1A","1A","-","- ","Acute toxicity – category 4",null," Hypothyroidism; URT irr","1A"]
[null,null,314,"Iodoform","75-47-8",0.6,10,null,null,null,null,null,2,2,"2","-","- ","-",null,"CNS impairment",4]
[null,null,315,"Iron oxide fume (Fe2O3) (as Fe)","1309-37-1",null,5,null,null,null,null,null,3,3,"3","-","- ","-",null,"Pneumoconiosis",3]
[null,null,316,"Iron pentacarbonyl (as Fe)","13463-40-6",0.1,0.23,null,0.2,0.45,null,null,2,2,"2","-","- ","-",null,"Pulmonary oedema; CNS impairment",4]
[null,null,317,"Iron salts, soluble (as Fe)",null,null,1,null,null,null,null,null,"1B","1B","1B","-","- ","-",null,"URT & skin irr","1B"]
[null,null,318,"Isoamyl acetate (Isopentyl acetate)","123-92-2",50,270,null,100,541,null,null,"1B","1B","1B","-","- ","-",null,null,"1B"]
[null,null,319,"Isoamyl alcohol (3-Methylbutan-1-ol)","123-51-3",100,361,null,125,452,null,null,2,2,"2","-","- ","-",null,"Eye & URT irr",4]
[null,null,320,"Isobutyl acetate","110-19-0",150,713,null,null,null,null,null,"1B","1B","1B","-","- ","STOT (single exposure) – category 3","Possibly a Cat 2 given GHS STOT hazard category.  Sparse documentation, is an irritant, acute effect of potential drowsiness.",null,"1B","M"]
[null,null,321,"Isobutyl alcohol (2-Methylpropan-1-ol; iso-Butanol)","78-83-1",50,152,null,null,null,null,null,"1B","1B","1B","-","- ","STOT (single exposure) – category 3\nSkin irritation – category 2\nEye damage – category 1","Possibly a Cat 2 given GHS STOT hazard category.","Skin & eye irr","1B","M"]
[null,null,322,"Isocyanates, all (as-NCO)",null,null,0.02,null,null,7.0000000000000007E-2,null,null,3,3,"3","See individual entries","Sen ","Respiratory sensitisation – category 1\nSkin sensitisation – category 1\nSTOT (single exposure) – category 3"]
[null,null,323,"Isooctyl alcohol","26952-21-6",50,266,null,null,null,null,null,2,2,"2","-","Sk ","-",null,"URT irr; skin notation","1B"]
[null,null,324,"Isophorone (3,5,5-Trimethylcyclohex-2-enone)","78-59-1",null,null,null,null,null,5,28,"1A","1A","1A","Carc. 2","-","Carcinogenicity – category 2\nAcute toxicity – category 4\nEye irritation – category 2A\nSTOT (single exposure) – category 3","Should be changed to Cat 4 based on GHS chronic health and acute toxicity, but there is no TWA WES.  It is an irritant with only a peak / ceiling value, hence remains Cat 1A.","Eye & URT irr; CNS impair; malaise; fatigue","1A","M"]
[null,null,325,"Isophorone diisocyanate (3-isocyanatomethyl-3,5,5-trimethylcyclohexyl isocyanate)","4098-71-9",null,0.02,null,null,7.0000000000000007E-2,null,null,3,3,"3","-","Sen","Acute toxicity – category 3\nEye irritation – category 2\nSTOT (single exposure) – category 3\nSkin irritation – category 2\nSkin sensitisation – category 1\nRespiratory sensitisation – category 1",null,"Respiratory sensitiser",4]
[null,null,326,"Isopropoxyethanol (2-(1-methylethoxy)-ethanol)","109-59-1",25,106,null,null,null,null,null,3,2,"3","-","-","Acute toxicity – category 4\nEye irritation – category 2A","Classify as 2 but could also be 1B because acute effects are mild. Cat 2 is more conservative so may be best.","Haematologic effect",4,"Y"]
[null,null,327,"Isopropyl acetate (Acetic acid, 1-methylethyl ester)","108-21-4",250,1040,null,310,1290,null,null,"1B",2,"1B","-","-","STOT (single exposure) – category 3\nEye irritation – category 2A","Is an irritant, could also argue for chronic based on skin dryness cracking. Also narcotic effect implies Cat 2 - this is most conservative so may be appropriate.","Eye & URT irr; CNS impairment","1B","Y"]
[null,null,328,"Isopropyl alcohol (Propan-2-ol)","67-63-0",400,983,null,500,1230,null,null,2,2,"2","-","-","STOT (single exposure) – category 3\nEye irritation – category 2A",null,null,"1B"]
[null,null,329,"Isopropyl ether (Diisopropyl ether)","108-20-3",250,1040,null,310,1300,null,null,"1B","1B","1B","-","-","STOT (single exposure) – category 3","Possibly a Cat 2 given GHS STOT hazard category.","Eye & URT irr","1B","M"]
[null,null,330,"Isopropyl glycidyl ether (IGE, 2,3-Epoxypropyl isopropyl ether)","4016-14-2",50,238,null,75,356,null,null,3,3,"3","-","-","-",null,"URT & eye irr; dermatitis","1B"]
[null,null,331,"Isopropylamine (2-Aminopropane)","75-31-0",5,12,null,10,24,null,null,"1B","1B","1B","-","-","Acute toxicity – category 4\nAcute toxicity – category 3\nSTOT (single exposure) – category 3\nSkin corrosion – category 1A","Possibly a Cat 2 given GHS STOT hazard category.","Eye & URT irr; eye damage","1B","M"]
[null,null,332,"N-Isopropylaniline","768-52-5",2,11,null,null,null,null,null,2,2,"2","-","Sk","-",null,"MeHb-emia",4]
[null,null,333,"Kaolin ","1332-58-7",null,10,null,null,null,null,null,3,3,"3","-","-","-",null,null,3]
[null,null,334,"Ketene","463-51-4",0.5,0.86,null,1.5,2.6,null,null,2,2,"2","-","-","-",null,"URT irr; pulmonary oedema","1B"]
[null,null,335,"Lead arsenate (as Pb3(AsO4)2)","3687-31-8",null,0.15,null,null,null,null,null,4,4,"4","-","-","-",null,null,4]
[null,null,336,"Lead chromate (as Cr) ","7758-97-6",null,0.05,null,null,null,null,null,3,3,"3","Carc. 1B","-","Acute toxicity – category 3\nCarcinogenicity – category 1B\nGerm cell mutagenicity – category 2\nSTOT (repeated exposure) – category 2\nSkin sensitisation – category 1\nReproductive toxicity – category 1A",null,null,3]
[null,null,337,"Lead, inorganic dusts & fumes (as Pb)","7439-92-1",null,0.05,null,null,null,null,null,3,3,"3","-","-","Carcinogenicity – category 2\nGerm cell mutagenicity – category 2\nSTOT (repeated exposure) – category 2\nReproductive toxicity – category 1A",null,null,3]
[null,null,338,"Lindane (Gammexane, gamma-Hexachlorocyclohexane)","58-89-9",8.0000000000000002E-3,0.1,null,null,null,null,null,4,4,"4","-","Sk","Acute toxicity – category 3\nAcute toxicity – category 4\nSTOT (repeated exposure) – category 2\nReproductive toxicity – effects on or via lactation",null,null,4]
[null,null,339,"Lithium hydride","7580-67-8",null,2.5000000000000001E-2,null,null,null,null,null,"1B","1B","1B","-","-","-",null,"Eye & resp tract irr","1B"]
[null,null,340,"LPG (liquified petroleum gas)","68476-85-7",1000,1800,null,null,null,null,null,"1C",4,"1C","Carc. 1B","-","Carcinogenicity – category 1A\nGerm cell mutagenicity – category 1B","Is an asphyxiant, but also has long-term effects (see GHS classifications).","Asphyxia","1C","Y"]
[null,null,341,"Magnesite ","546-93-0",null,10,null,null,null,null,null,"1C","1C","1C","-","-","-",null,null,"1C"]
[null,null,342,"Magnesium oxide (fume)","1309-48-4",null,10,null,null,null,null,null,2,2,"2","-","-","-",null,"URT; metal fume fever",2]
[null,null,343,"Malathion (Maldison)","121-75-5",null,10,null,null,null,null,null,4,4,"4","-","Sk:Sen","Acute toxicity – category 4\nSkin sensitisation – category 1",null,"Cholinesterase inhib; skin notation",4]
[null,null,344,"Maleic anhydride","108-31-6",0.25,1,null,null,null,null,null,4,4,"4","-","Sen","Acute toxicity – category 4\nAcute toxicity – category 3\nSTOT (single exposure) – category 3\nSkin corrosion – category 1B\nRespiratory sensitisation – category 1\nSkin sensitisation – category 1",null,"Respiratory sensitiser",4]
[null,null,345,"Manganese cyclopenta-dienyl tricarbonyl (as Mn)","12079-65-1",null,0.1,null,null,null,null,null,4,4,"4","-","Sk","-",null,"Skin irr; CNS impairment; skin notation",4]
[null,null,346,"Manganese, dust & compounds (as Mn)","7439-96-5",null,1,null,null,null,null,null,3,3,4,"-","- ","STOT (repeated exposure) – category 1",null,"CNS impairment - TWA= 0.02 mg/m3 (R) & 0.1 mg/m3 (I)",3]
[null,null,347,"Manganese, fume (as Mn) (Manganese tetroxide)","7439-96-5",null,1,null,null,3,null,null,3,3,"4","-","- ","STOT (repeated exposure) – category 1",null,"CNS impairment - TWA= 0.02 mg/m3 (R) & 0.1 mg/m3 (I)",3]
[null,null,348,"Man-Made Vitreous (Silicate) Fibres - Continuous glass filament",null,null,2,null,null,null,null,null,"1B","1B","1C","Carc. 2(i)(k) or exempt(m)(n)(o)","-","-",null,"URT, skin & eye irr","1C"]
[null,null,349,"Man-Made Vitreous (Silicate) Fibres - Glass wool",null,null,2,null,null,null,null,null,"1B","1B","1C","Carc. 2(i)(k) or exempt(m)(n)(o)","-","-",null,"URT, skin & eye irr","1C"]
[null,null,350,"Man-Made Vitreous (Silicate) Fibres - High Biopersistence MMVF",null,null,2,0.5,null,null,null,null,3,3,"3","Carc. 1B (o)","-","-",null,"Pulm fibrosis; pulm function","1C"]
[null,null,351,"Man-Made Vitreous (Silicate) Fibres - Low Biopersistence MMVF",null,null,2,null,null,null,null,null,"1B","1B","1B","Carc. 2(i)(k) or exempt(m)(n)(o)","-","-",null,"URT, skin & eye irr","1C"]
[null,null,352,"Man-Made Vitreous (Silicate) Fibres - Refractory Ceramic Fibres (RCF)",null,null,2,0.5,null,null,null,null,3,3,"3","Carc. 1B (o)","-","Carcinogenicity – category 1B",null,"Pulm fibrosis; pulm function","1C"]
[null,null,353,"Man-Made Vitreous (Silicate) Fibres - Rock (stone) wool",null,null,2,null,null,null,null,null,"1B","1B","1B","Carc. 2(i)(k) or exempt(m)(n)(o)","-","Carcinogenicity – category 2",null,"URT, skin & eye irr","1C"]
[null,null,354,"Man-Made Vitreous (Silicate) Fibres - Slag wool",null,null,2,null,null,null,null,null,"1B","1B","1B","Carc. 2(i)(k) or exempt(m)(n)(o)","-","Carcinogenicity – category 2",null,"URT, skin & eye irr","1C"]
[null,null,355,"Man-Made Vitreous (Silicate) Fibres - Special Purpose Glass Fibres",null,null,2,0.5,null,null,null,null,3,3,"3","Carc. 1B (o)","-","Carcinogenicity – category 1B",null,"Pulm fibrosis; pulm function","1C"]
[null,null,356,"Mercury, alkyl compounds (as Hg)",null,null,0.01,null,null,0.03,null,null,4,4,"4","-","Sk ","Acute toxicity – category 1\nAcute toxicity – category 2\nSTOT (repeated exposure) – category 2",null,"CNS & PNS impairment; kidney damage; skin notation",4]
[null,null,357,"Mercury, aryl compounds (as Hg)",null,null,0.1,null,null,null,null,null,3,4,"3","-","Sk ","Acute toxicity – category 1\nAcute toxicity – category 2\nSTOT (repeated exposure) – category 2","Should be a 4 considering GHS classifications and ACGIH documentation for alkyl compounds.","CNS impairment; kidney damage; skin notation",4,"Y"]
[null,null,358,"Mercury, elemental vapour (as Hg)","7439-97-6",3.0000000000000001E-3,2.5000000000000001E-2,null,null,null,null,null,3,4,"3","-","- ","Acute toxicity – category 1\nReproductive toxicity – category 1B\nSTOT (repeated exposure) – category 1","Should be a 4 considering GHS classifications and ACGIH documentation for alkyl compounds.","CNS impairment; kidney damage; skin notation",null,"Y"]
[null,null,359,"Mercury, inorganic divalent compounds (as Hg)","7439-97-6",3.0000000000000001E-3,2.5000000000000001E-2,null,null,null,null,null,3,4,3,"-","- ","Acute toxicity – category 1\nReproductive toxicity – category 1B\nSTOT (repeated exposure) – category 1","Should be a 4 considering GHS classifications and ACGIH documentation for alkyl compounds.","CNS impairment; kidney damage; skin notation",null,"Y"]
[null,null,360,"Mercury, inorganic monovalent compounds (as Hg)",null,null,0.1,null,null,null,null,null,3,4,"3","-","Sk ","Acute toxicity – category 1\nAcute toxicity – category 2\nSTOT (repeated exposure) – category 2","Should be a 4 considering GHS classifications and ACGIH documentation for alkyl compounds.","CNS impairment; kidney damage; skin notation",null,"Y"]
[null,null,361,"Mesityl oxide (4-Methylpent-3-en-2-one)","141-79-7",15,60,null,25,100,null,null,"1B","1B","1B","-","- ","Acute toxicity – category 4",null,"Eye & URT irr; CNS impairment",3]
[null,null,362,"Methacrylic acid","79-41-4",20,70,null,null,null,null,null,"1B","1B","1B","-","-","Acute toxicity – category 4\nSkin corrosion – category 1A\nAcute toxicity – category 3",null,"Skin & eye irr","1B"]
[null,null,363,"Methomyl (Lannate)","16752-77-5",null,2.5,null,null,null,null,null,4,4,"4","-","-","Acute toxicity – category 2",null,"Cholinesterase inhibition; male repro damage; haematologic effect",2]
[null,null,364,"1-Methoxy-2-propanol acetate","108-65-6",50,274,null,100,548,null,null,"1B","1B",null,"-","Sk ","-",null,"(SCOEL documentation - URT irr)"]
[null,null,365,"Methoxychlor (2,2-bis(p-Methoxyphenyl)-1,1,1-trichloroethane; DMDT)","72-43-5",null,10,null,null,null,null,null,3,3,"4","-","-","-","No mention of CNS in documentation.","Liver damage; CNS impairment (based on animal studies)",3]
[null,null,366,"2-Methoxyethanol (Methyl cellosolve, Methyl gylcol, Glycol monomethyl ether, Ethylene glycol monomethyl ether)","109-86-4",5,16,null,null,null,null,null,4,4,"4","-","Sk","Acute toxicity – category 4\nReproductive toxicity – category 1B",null,"Haematological effect; repro effect; skin notation",4]
[null,null,367,"2-Methoxyethyl acetate (Ethylene glycol monomethyl ether acetate, Glycol monomethyl ether acetate, Methyl glycol acetate, Methyl cellosolve acetate)","110-49-6",5,24,null,null,null,null,null,4,4,"4","-","Sk","Acute toxicity – category 4\nReproductive toxicity – category 1B",null,"Haematological effect; repro effect; skin notation",4]
[null,null,368,"(2-Methoxymethylethoxy) propenol (Dipropylene glycol (mono) methyl ether)","34590-94-8",50,308,null,null,null,null,null,2,2,"2","-","Sk","-",null,"Eye & URT irr; CNS impairment; skin notation",4]
[null,null,369,"4-Methoxyphenol (Mequinol (INN))","150-76-5",null,5,null,null,null,null,null,4,4,"1B","-","Sen","Acute toxicity – category 4\nEye irritation – category 2\nSkin sensitisation – category 1",null,"Eye irr; skin damage",4]
[null,null,370,"Methyl 2-cyanoacrylate (mecrilate)","137-05-3",2,9.1,null,4,18,null,null,"1B","1B","3","-","-","Eye irritation – category 2\nSTOT (single exposure) – category 3\nSkin irritation – category 2","Possibly a Cat 2 given GHS STOT hazard category.","URT & eye irr (& possible sensitisation)","1B","M"]
[null,null,371,"Methyl acetate","79-20-9",200,606,null,250,757,null,null,2,2,"2","-","-","Eye irritation – category 2\nSTOT (single exposure) – category 3",null,null,4]
[null,null,372,"Methyl acetylene (Propyne)","74-99-7",1000,1640,null,null,null,null,null,"1C","1C","1C","-","-","-",null,"CNS impairment",2]
[null,null,373,"Methyl acetylene-propadiene mixture (MAPP)","59355-75-8",1000,1640,null,1250,2050,null,null,"1C","1C","1C","-","-","-",null,"CNS impairment",2]
[null,null,374,"Methyl acrylate (Acrylic acid, methyl ester)","96-33-3",10,35,null,null,null,null,null,3,3,"3","-","Sk:Sen","Acute toxicity – category 4\nAcute toxicity – category 3\nEye irritation – category 2A\nSkin irritation – category 2\nSTOT (single exposure) – category 3\nSkin sensitisation – category 1",null,"Eye, skin & URT irr; eye damage","1B"]
[null,null,375,"Methyl alcohol (Methanol)","67-56-1",200,262,null,250,328,null,null,4,2,"4",null,"Sk","Acute toxicity – category 3\nSTOT (single exposure) – category 1","Should be Cat 2 given GHS STOT hazard category and ACGIH documentation.  No mention of long-term effects!","Headache; eye damage; dizziness; nausea; skin notation",4,"Y"]
[null,null,376,"N-Methyl aniline","100-61-8",0.5,2.2000000000000002,null,null,null,null,null,4,4,"4",null,"Sk","Acute toxicity – category 3\nSTOT (repeated exposure) – category 2",null,"MeHb-emia; CNS impairment; skin notation",4]
[null,null,377,"Methyl bromide (Bromomethane)","74-83-9",5,19,null,null,null,null,null,4,4,"4",null,"Sk","Germ cell mutagenicity – category 2\nAcute toxicity – category 3\nEye irritation – category 2\nSTOT (single exposure) – category 3\nSkin irritation – category 2\nSTOT (repeated exposure) – category 2",null,"URT & skin irr; skin notation",4]
[null,null,378,"Methyl chloride (Chloromethane)","74-87-3",50,103,null,100,207,null,null,4,4,"4","Carc. 2","-","Acute toxicity – category 4\nCarcinogenicity – category 2\nSTOT(repeated exposure) – category 2",null,"CNS impairment; liver, kidney & testicular damage; teratogenic effect; skin notation",4]
[null,null,379,"Methyl demeton (Demeton-O-methyl plus demeton-S-methyl; Metasystox)","8022-00-2",null,0.5,null,null,null,null,null,4,4,"4","-","Sk","-",null,"Cholinesterase inhibition; skin notation",4]
[null,null,380,"Methyl ethyl ketone (MEK, 2-Butanone)","78-93-3",150,445,null,300,890,null,null,"1B",2,"1B","-","- ","Eye irritation – category 2A\nSTOT (single exposure) – category 3","Is an irritant, could argue for chronic based on skin dryness cracking. Also narcotic effect implies Cat 2 - this is most conservative so may be appropriate.","URT irr; CNS & PNS impairment",4,"Y"]
[null,null,381,"Methyl ethyl ketone peroxide (2-Butanone, peroxide)","1338-23-4",null,null,null,null,null,0.2,1.5,"1A","1A","1A","-","- ","Acute toxicity – category 4\nSkin corrosion – category 1B\nGerm cell mutagenicity – category 2\nSTOT (single exposure) – category 3","Could be changed to Cat 2 based on GHS STOT hazard category, but there is no TWA WES.  It is an irritant with only a peak / ceiling value, hence remains Cat 1A.","Eye & skin irr; liver & kidney damage","1A","M"]
[null,null,382,"Methyl formate (Formic acid, methyl ester)","107-31-3",100,246,null,150,368,null,null,"1B",2,"1B","-","- ","Acute toxicity – category 4\nEye irritation – category 2\nSTOT (single exposure) – category 3","Should be Cat 2 given GHS STOT hazard category.","CNS impairment; URT irr; eye damage","1B","Y"]
[null,null,383,"Methyl hydrazine","60-34-4",0.01,1.9E-2,null,null,null,null,null,4,4,"1A","-","Sk ","Acute toxicity – category 2\nAcute toxicity – category 1\nCarcinogenicity – category 1B\nSTOT (repeated exposure) – category 1",null,"URT & eye irr; lung cancer; liver damage; skin notation",4]
[null,null,384,"Methyl iodide (Iodomethane)","74-88-4",2,12,null,null,null,null,null,4,4,"4","Carc. 2","Sk ","Acute toxicity – category 3\nCarcinogenicity – category 2\nEye damage – category 1\nSkin irritation – category 2\nSTOT (single exposure) – category 3",null,"Eye damage; CNS impairment; skin notation",4]
[null,null,385,"Methyl isoamyl ketone (Isoamyl methyl ketone; 5-Methyl-2-hexanone)","110-12-3",50,234,null,null,null,null,null,"1B","1B","1B","-","- ","Acute toxicity – category 4",null,"CNS impairment; URT irr",4]
[null,null,386,"Methyl isobutyl carbinol (Methyl amyl alcohol; 4-methyl-2-Pentanol)","108-11-2",25,104,null,40,167,null,null,"1B",2,"1B","-","Sk ","Acute toxicity – category 4\nEye irritation – category 2A\nSkin irritation – category 2\nSTOT (single exposure) – category 3","Is an irritant, also harmful if inhaled with GHS STOT hazard category implies Cat 2","URT & eye irr; CNS impairment; skin notation","1B","Y"]
[null,null,387,"Methyl isobutyl ketone (MIBK, Hexone, 4-Methyl-2-pentanone)","108-10-1",50,205,null,75,307,null,null,"1B",2,"1B","-","- ","Acute toxicity – category 4\nCarcinogenicity – category 2\nEye irritation – category 2A\nSTOT (single exposure) – category 3","Is an irritant, but also CNS and GI (ACGIH) with GHS STOT hazard category implies Cat 2","URT irr; dizziness; headache",4,"Y"]
[null,null,388,"Methyl isocyanate","624-83-9",null,0.02,null,null,7.0000000000000007E-2,null,null,3,4,"3","-","Sen ","Acute toxicity – category 3\nSkin corrosion – category 1B\nRespiratory sensitisation – category 1\nSkin sensitisation – category 1\nGerm cell mutagenicity – category 2\nReproductive toxicity – category 2\nSTOT (single exposure) – category 3\nSTOT (repeated exposure) – category 1","Change to 4 based on GHS & ACGIH chronic health and acute toxicity. Also an irritant.","URT & eye irr; skin & DSEN notation",4,"Y"]
[null,null,389,"Methyl isopropyl ketone (3-Methyl-2-butanone)","563-80-4",200,705,null,null,null,null,null,"1B",3,"1B","-","- ","-","Change to 3 given ACGIH documentation.","Embryo / foetal damage; neonatal toxicity","1B","Y"]
[null,null,390,"Methyl mercaptan (Methanethiol)","74-93-1",0.5,0.98,null,null,null,null,null,"1B",3,"1B","-","- ","Acute toxicity – category 3","Should be Cat 3 given ACGIH documentation","Liver damage, systemic","1B","Y"]
[null,null,391,"Methyl methacrylate (Methacrylic acid, methyl ester)","80-62-6",50,208,null,100,416,null,null,4,4,"1B","-","Sen ","Skin irritation – category 2\nSTOT (single exposure) – category 3\nSkin sensitisation – category 1",null,"URT & eye irr; body weight effects; pulmonary oedema; sensitiser",2]
[null,null,392,"Methyl n-amyl ketone (2-Heptanone; Heptan-2-one)","110-43-0",50,233,null,null,null,null,null,"1B","1B","1B","-","- ","Acute toxicity – category 4",null,"Eye & skin irr",4]
[null,null,393,"Methyl n-butyl ketone (2-Hexanone)","591-78-6",5,20,null,null,null,null,null,3,3,"3","-","Sk ","Reproductive toxicity – category 2\nSTOT (single exposure) – category 3\nSTOT (repeated exposure) – category 1",null,"Peripheral neuropothy; testicular damage",4]
[null,null,394,"Methyl parathion","298-00-0",null,0.2,null,null,null,null,null,4,4,"4","-","Sk ","Acute toxicity – category 2\nAcute toxicity – category 3\nSTOT (repeated exposure) – category 2",null,"Cholinesterase inhibition",4]
[null,null,395,"Methyl propyl ketone (2-Pentanone)","107-87-9",200,705,null,250,881,null,null,2,2,"2","-","- ","-",null,null,2]
[null,null,396,"Methyl silicate (Tetramethyl orthosilicate)","681-84-5",1,6,null,null,null,null,null,2,2,"2","-","- ","-",null,"URT irr; eye damage","1B"]
[null,null,397,"alpha-Methyl styrene (2-Phenylpropene)","98-83-9",50,242,null,100,483,null,null,2,4,"2","-","- ","Eye irritation – category 2A\nCarcinogenicity – category 2\nSTOT (single exposure) – category 3","Change to 4 based on ACGIH classification and GHS chronic health (cancer) and acute toxicity.","URT irr; kidney damage; female repro damage",4,"Y"]
[null,null,398,"1-Methyl-2-pyrrolidone","872-50-4",25,103,null,75,309,null,null,4,4,null,"-","Sk ","Eye irritation – category 2A\nSkin irritation – category 2\nSTOT (single exposure) – category 3\nReproductive toxicity – category 1B",null,"(SCOEL documentation - URT irr; chemosensory effects; reproductive toxicity)"]
[null,null,399,"Methylacrylonitrile","126-98-7",1,2.7,null,null,null,null,null,4,4,"4","-","Sk:Sen","Acute toxicity – category 3\nSkin sensitisation – category 1",null,"CNS impairment; eye & skin irr; skin notation",4]
[null,null,400,"Methylal (Dimethoxymethane)","109-87-5",1000,3110,null,null,null,null,null,"1B","1B","1B","-","- ","-",null,"Eye irr; CNS impairment",4]
[null,null,401,"Methylamine ","74-89-5",10,13,null,null,null,null,null,"1B","1B","1B","-","- ","Acute toxicity – category 4\nSTOT (single exposure) – category 3\nEye damage – category 1\nSkin irritation – category 2","Possibly a Cat 2 given GHS STOT hazard category, but ACGIH documentation is for irritation only.","Eye, skin & URT irr","1B","M"]
[null,null,402,"Methylcyclohexane","108-87-2",400,1610,null,null,null,null,null,"1B",2,"1B","-","- ","Skin irritation – category 2\nSTOT (single exposure) – category 3","Possibly a Cat 2 given GHS STOT hazard category and ACGIH documentation is based on analogy to heptane acute effects.","URT irr; CNS impairment; liver & kidney damage",4,"Y"]
[null,null,403,"Methylcyclohexanol","25639-42-3",50,234,null,null,null,null,null,3,"1B","3","-","- ","Acute toxicity – category 4","There do not appear to be any long-term effects documented, just irritation.  Potential short-term effects found in animals.","URT & eye irr",4,"Y"]
[null,null,404,"o-Methylcyclohexanone","583-60-8",50,229,null,75,344,null,null,"1B","1B","1B","-","Sk ","Acute toxicity – category 4",null,"URT & eye irr; CNS impairment; skin notation","1B"]
[null,null,405,"Methylcyclopentadienyl manganese tricarbonyl (as Mn)","12108-13-3",null,0.2,null,null,null,null,null,4,4,"4","-","Sk ","Acute toxicity – category 1\nSTOT (repeated exposure) – category 1",null,"CNS impairment; lung, liver & kidney damage",4]
[null,null,406,"4,4’-Methylene bis (2-chloroaniline) (MOCA, MBOCA, 2,2'-Dichloro-4,4'-methylenedianiline)","101-14-4",0.02,0.22,null,null,null,null,null,4,4,"4","Carc. 1B","Sk","Acute toxicity – category 4\nCarcinogenicity – category 1B\nGerm cell mutagenicity – category 2",null,"Bladder cancer; MeHb-emia; skin notation",3]
[null,null,407,"Methylene bis (4-cyclo-hexylisocyanate)","5124-30-1",null,0.02,null,null,7.0000000000000007E-2,null,null,3,3,"3","-","Sen","Acute toxicity – category 3\nEye irritation – category 2\nSTOT (single exposure) – category 3\nSkin irritation – category 2\nSkin sensitisation – category 1\nRespiratory sensitisation – category 1",null,"Respiratory sensitiser; LRT irr","1B"]
[null,null,408,"Methylene bisphenyl isocyanate (MDI, Diphenylmethane diisocyanate)","101-68-8",null,0.02,null,null,7.0000000000000007E-2,null,null,3,4,"3","Carc. 2","Sen","Acute toxicity – category 2\nCarcinogenicity – category 2\nEye irritation – category 2A\nSkin irritation – category 2\nSTOT (repeated exposure) – category 1\nRespiratory sensitisation – category 1\nSkin sensitisation – category 1\nSTOT (single exposure) – category 3","Has acute (irritant) as well as chronic (cancer & sensitiser) effects.","Respiratory sensitiser",4,"Y"]
[null,null,409,"Methylene chloride (Dichloromethane)","75-09-2",50,174,null,null,null,null,null,4,4,"4","Carc. 2","Sk","STOT (single exposure) – category 3\nCarcinogenicity – category 2\nEye irritation – category 2A\nSkin irritation – category 2",null,"COHb-emia; CNS impairment",2]
[null,null,410,"4,4'-Methylene dianiline (MDA, DADPM, DDM, p,p'-Diaminodiphenylmethane)","101-77-9",0.1,0.81,null,null,null,null,null,3,3,"3","Carc. 1B","Sk:Sen","STOT (single exposure) – category 1\nCarcinogenicity – category 1B\nGerm cell mutagenicity – category 1A\nSTOT (repeated exposure) – category 2\nSkin sensitisation – category 1",null,"Liver damage; skin notation",3]
[null,null,411,"5-Methylheptan-3-one (Ethyl amyl ketone)","541-85-5",10,53,null,20,107,null,null,"1B",2,"1B","-","- ","Eye irritation – category 2\nSTOT (single exposure) – category 3","Should be Cat 2 given GHS STOT hazard category and ACGIH documentation of neurotoxic effects.","Neurotoxicity","1B","Y"]
[null,null,412,"Methyl-tert butyl ether","1634-04-4",25,92,null,75,275,null,null,4,4,"4","-","- ","Skin irritation – category 2","Said to have both short and long-term effects in PubChem.","No data",4]
[null,null,413,"Metribuzin (Sencor)","21087-64-9",null,5,null,null,null,null,null,2,2,"2","-","- ","Acute toxicity – category 4",null,"Liver damage; haematological effect",4]
[null,null,414,"Mevinphos (Phosdrin)","7786-34-7",0.01,9.1999999999999998E-2,null,0.03,0.27,null,null,4,4,"4","-","Sk ","Acute toxicity – category 1\nAcute toxicity – category 2",null,"Cholinesterase inhibition",4]
[null,null,415,"Mica","12001-26-2",null,2.5,null,null,null,null,null,3,3,"3","-","- ","-",null,"Pneumoconiosis",3]
[null,null,416,"Mineral turpentine",null,null,480,null,null,null,null,null,4,4,null,"-","- ","-",null,"Eye, skin & kidney damage; nausea; CNS impairment",2]
[null,null,417,"Molybdenum, insoluble compounds (as Mo)","7439-98-7",null,10,null,null,null,null,null,"1C","1C","1C","-","- ","-",null,"LRT irr",4]
[null,null,418,"Molybdenum, soluble compounds (as Mo)","7439-98-7",null,5,null,null,null,null,null,"1C","1C","1C","-","- ","-",null,"LRT irr",4]
[null,null,419,"Monochloroacetic acid","79-11-8",0.3,1.2,null,null,null,null,null,"1B","1B",null,"-","Sk ","Acute toxicity – category 3\nSkin corrosion – category 1B",null,"(SCOEL documentation - eye & skin irr; chemical burns; no data to support health-based OEL)"]
[null,null,420,"Monocrotophos (Azodrin)","6923-22-4",null,0.25,null,null,null,null,null,4,4,"4","-","- ","Germ cell mutagenicity – category 2\nAcute toxicity – category 2\nAcute toxicity – category 3",null,"Cholinesterase inhib; skin notation",2]
[null,null,421,"Morpholine","110-91-8",20,71,null,null,null,null,null,"1B","1B","1B","-","Sk ","Acute toxicity – category 4\nSkin corrosion – category 1",null,"Eye damage; URT irr; skin notation","1B"]
[null,null,422,"Naled (Dibrom; Dimethyl-1,2-dibromo-2,2-dichloroethylphosphate)","300-76-5",null,3,null,null,null,null,null,4,4,"4","-","Sk ","Acute toxicity – category 4\nEye irritation – category 2\nSkin irritation – category 2",null,"Cholinesterase inhibition; skin & DSEN notation",4]
[null,null,423,"Naphthalene","91-20-3",10,52,null,15,79,null,null,4,4,"1B","Carc. 2","- ","Acute toxicity – category 4\nCarcinogenicity – category 2\nSTOT (single exposure) – category 3",null,"URT irr; cataracts; haemolitic anaemia; skin notation",4]
[null,null,424,"Nickel carbonyl (as Ni) (Tetracarbonyl nickel)","13463-39-3",0.05,0.12,null,null,null,null,null,2,4,"2","Carc. 2","- ","Carcinogenicity – category 2\nReproductive toxicity – category 1B\nAcute toxicity – category 2","Has acute as well as chronic (Carc) effects.","Lung irr; ceiling value assigned",4,"Y"]
[null,null,425,"Nickel dichloride","7718-54-9",null,0.1,null,null,null,null,null,3,3,null,"Carc. 1A","-","Acute toxicity – category 4\nAcute toxicity – category 3\nCarcinogenicity – category 1A\nGerm cell mutagenicity – category 2\nSTOT (repeated exposure) – category 1\nReproductive toxicity – category 1B\nRespiratory sensitisation – category 1\nSkin irritation – category 2\nSkin sensitisation – category 1","Main effect is chronic - some acute effects - but at lower end. Also a sensitiser. Could be 3 or 4","Lung damage; nasal cancer (based on soluble compounds)",3,"M"]
[null,null,426,"Nickel dinitrate","13138-45-9",null,0.1,null,null,null,null,null,3,3,null,"Carc. 1A","-","Acute toxicity – category 4\nCarcinogenicity – category 1A\nEye damage – category 1\nSkin irritation – category 2\nSTOT (repeated exposure) – category 1\nRespiratory sensitisation – category 1\nSkin sensitisation – category 1\nGerm cell mutagenicity – category 2\nReproductive toxicity – category 1B","Main effect is chronic - some acute effects - but at lower end. Also a sensitiser. Could be 3 or 4","Lung damage; nasal cancer (based on soluble compounds)",3,"M"]
[null,null,427,"Nickel, metal","7440-02-0",null,1,null,null,null,null,null,3,3,"3","Carc. 2","Sen","Carcinogenicity – category 2\nSTOT (repeated exposure) – category 1\nSkin sensitisation – category 1",null,"Dermatitis; pneumoconiosis",4]
[null,null,428,"Nickel, powder","7440-02-0",null,1,null,null,null,null,null,3,3,"3","Carc. 2","-","Carcinogenicity – category 2\nSTOT (repeated exposure) – category 1\nSkin sensitisation – category 1",null,"Lung cancer",4]
[null,null,429,"Nickel salt, nitric acid","14216-75-2",null,0.1,null,null,null,null,null,3,3,null,"Carc. 1A","-","Carcinogenicity – category 1A\nGerm cell mutagenicity – category 2\nReproductive toxicity – category 1B\nAcute toxicity – category 4\nSkin irritation – category 2\nRespiratory sensitisation – category 1\nSkin sensitisation – category 1\nSTOT (repeated exposure) – category 1\nEye damage – category 1",null,"Lung damage; nasal cancer (based on soluble compounds)",3]
[null,null,430,"Nickel, soluble compounds (as Ni)","7440-02-0",null,0.1,null,null,null,null,null,3,3,"3","See Notes","Sen","Carcinogenicity – category 2\nSTOT (repeated exposure) – category 1\nSkin sensitisation – category 1",null,"Lung damage; nasal cancer",3]
[null,null,431,"Nickel sulphide roasting (fume & dust) (as Ni)",null,null,1,null,null,null,null,null,3,3,"3","Carc. 1A","Sen","-",null,"Lung cancer",3]
[null,null,432,"Nicotine","54-11-5",null,0.5,null,null,null,null,null,2,2,"2","-","Sk ","Acute toxicity – category 1\nAcute toxicity – category 3",null,"GI damage; CNS impairment; cardiac impairment",4]
[null,null,433,"Nitrapyrin (N-Serve; 2-Chloro-6-(trichloromethyl) pyridine)","1929-82-4",null,10,null,null,20,null,null,"1C",3,"1C","-","- ","Acute toxicity – category 4\nEye irritation – category 2A\nCarcinogenicity – category 2\nSkin sensitisation – category 1","Carcinogenicity, sensitisation and liver damage suggest Cat 3.","Liver damage","1C","Y"]
[null,null,434,"Nitric acid","7697-37-2",2,5.2,null,4,10,null,null,2,2,"2","-","- ","Skin corrosion – category 1\nOxidising liquid – category 2",null,"URT & eye irr; dental erosion","1B"]
[null,null,435,"Nitric oxide (Nitrogen monoxide)","10102-43-9",25,31,null,null,null,null,null,2,2,"2","-","- ","-",null,"Hypoxia / cyanosis; nitrosyl-Hb form; URT irr",2]
[null,null,436,"p-Nitroaniline","100-01-6",null,3,null,null,null,null,null,4,4,"4","-","Sk ","Acute toxicity – category 3\nSTOT (repeated exposure) – category 2",null,"MeHb-emia; liver damage; eye irr; skin notation",4]
[null,null,437,"Nitrobenzene","98-95-3",1,5,null,null,null,null,null,4,4,"4","Carc. 2","Sk","Acute toxicity – category 3\nCarcinogenicity – category 2\nReproductive toxicity – category 2\nSTOT (repeated exposure) – category 1","SCOEL - also experimental tumourogenicity","MeHb-emia; skin notation",4]
[null,null,438,"p-Nitrochlorobenzene (p-Chloronitrobenzene; 1-chloro-4-nitrobenzene)","100-00-5",0.1,0.64,null,null,null,null,null,4,4,"4","Carc. 2","Sk","Carcinogenicity – category 2\nGerm cell mutagenicity – category 2\nAcute toxicity – category 3\nSTOT (repeated exposure) – category 2",null,"MeHb-emia; skin notation",4]
[null,null,439,"Nitroethane","79-24-3",100,307,null,null,null,null,null,"1B","1B","1B","-","-","Acute toxicity – category 4","TLV / WES set to prevent irritation effects.  Other effects occur at much higher exposures.","URT irr; CNS impairment; liver damage","1B"]
[null,null,440,"Nitrogen dioxide","10102-44-0",3,5.6,null,5,9.4,null,null,4,"1B","4","-","-","Acute toxicity – category 2\nSkin corrosion – category 1B","TLV is set to protect from respiratory tract irritation, hence Cat 1B.","LRT irr",4,"Y"]
[null,null,441,"Nitrogen trifluoride","7783-54-2",10,29,null,null,null,null,null,2,2,"2","-","-","-",null,"MeHb-emia; liver & kidney damage",4]
[null,null,442,"Nitroglycerin (NG, Glyceryl trinitrate)","55-63-0",0.05,0.46,null,null,null,null,null,2,2,"1A","-","Sk ","Acute toxicity – category 1\nAcute toxicity – category 2\nSTOT (repeated exposure) – category 2",null,"Vasodilation; skin notation",4]
[null,null,443,"Nitromethane","75-52-5",20,50,null,null,null,null,null,4,4,"4","-","-","Acute toxicity – category 4",null,"Thyroid effect; URT irr; lung damage",3]
[null,null,444,"1-Nitropropane","108-03-2",25,91,null,null,null,null,null,3,3,"3","-","-","Acute toxicity – category 4",null,"URT & eye irr; liver damage","1B"]
[null,null,445,"2-Nitropropane","79-46-9",10,36,null,null,null,null,null,3,3,"3","Carc. 1B","-","Acute toxicity – category 4\nCarcinogenicity – category 1B\nGerm cell mutagenicity – category 2","As for Nickel dinitrate - Main effect is chronic - some acute effects - but at lower end. Also a sensitiser. Could be 3 or 4","Liver damage; liver cancer",4,"M"]
[null,null,446,"2-Nitrotoluene","88-72-2",2,11,null,null,null,null,null,4,3,"2","Carc. 1B","Sk","Carcinogenicity – category 1B\nGerm cell mutagenicity – category 1B\nReproductive toxicity – category 2\nAcute toxicity – category 4","Acute toxicity is harmful only - there is also an argument to stay at 4.","MeHb-emia; skin notation",3,"Y"]
[null,null,447,"3-Nitrotoluene","99-08-1",2,11,null,null,null,null,null,2,2,"2","-","Sk","-",null,"MeHb-emia",3]
[null,null,448,"4-Nitrotoluene","99-99-0",2,11,null,null,null,null,null,2,2,"2","-","Sk","Acute toxicity – category 3\nSTOT (repeated exposure) – category 2",null,"MeHb-emia",3]
[null,null,449,"Nitrous oxide (Dinitrogen monoxide, Laughing gas)","10024-97-2",25,45,null,null,null,null,null,3,3,"3","-","-","-",null,"CNS impairment; haematological effect; embryo / foetal damage",4]
[null,null,450,"Nonane","111-84-2",200,1050,null,null,null,null,null,2,2,"2","-","-","-",null,"CNS impairment","1B"]
[null,null,451,"Octachloronaphthalene","2234-13-1",null,0.1,null,null,0.3,null,null,3,3,"3","-","Sk ","-",null,"Liver damage; skin notation",3]
[null,null,452,"Octane","111-65-9",300,1400,null,375,1750,null,null,2,2,"2","-","- ","Skin irritation – category 2\nSTOT (single exposure) – category 3",null,"URT irr",2]
[null,null,453,"Oil mist, refined mineral","8012-95-1",null,5,null,null,null,null,null,3,"1B","3","-","- ","-","Given ACGIH documentation, should be Cat 1B.","URT irr",1,"Y"]
[null,null,454,"Osmium tetroxide (as Os)","20816-12-0",2.0000000000000001E-4,1.6000000000000001E-3,null,5.9999999999999995E-4,4.7000000000000002E-3,null,null,"1B","1B","1B","-","- ","Acute toxicity – category 1\nAcute toxicity – category 2\nSkin corrosion – category 1B",null,"Eye, URT & skin irr","1B"]
[null,null,455,"Oxalic acid","144-62-7",null,1,null,null,2,null,null,"1B","1B","1B","-","- ","Acute toxicity – category 4\nSkin corrosion – category 1B\nSTOT (repeated exposure) – category 2","Possibly a Cat 4 given GHS STOT hazard category and irritant properties.","URT, eye & skin irr","1B","?"]
[null,null,456,"2,2'-Oxybis[ethanol] (Diethylene glycol)","111-46-6",23,100,null,null,null,null,null,2,2,null,"-","- ","Acute toxicity – category 4","UK HSE documentation - oxaluria & kidney damage.","No data"]
[null,null,457,"Oxygen difluoride","7783-41-7",null,null,null,null,null,0.05,0.11,"1A","1A","1A","-","- ","-",null,"Headache; pulm edema; URT irr","1A"]
[null,null,458,"Ozone","10028-15-6",null,null,null,null,null,0.1,0.2,"1A","1A","1A","-","- ","-",null,"Pulmonary function",2]
[null,null,459,"Paraffin wax (fume)","8002-74-2",null,2,null,null,null,null,null,"1B","1B","1B","-","- ","-",null,"URT irr; nausea","1B"]
[null,null,460,"Paraquat (respirable sizes) (Paraquat dichloride (ISO))","4685-14-7",null,0.1,null,null,null,null,null,3,4,"3","-","- ","Acute toxicity – category 2\nAcute toxicity – category 3\nSTOT (repeated exposure) – category 1\nSTOT (single exposure) – category 3\nSkin irritation – category 2\nEye irritation – category 2","Should be Cat 4 given GHS acute effects classification.","Lung damage",4,"Y"]
[null,null,461,"Parathion","56-38-2",null,0.1,null,null,null,null,null,4,4,"4","-","Sk ","Acute toxicity – category 2\nAcute toxicity – category 3\nSTOT (repeated exposure) – category 1",null,"Cholinesterase inhib; skin notation",4]
[null,null,462,"PCBs (42% Chlorine) (Polychlorinated biphenyls, Polychlorobiphenyls, Chlorobiphenyl)","53469-21-9?",null,1,null,null,2,null,null,3,3,"3","-","Sk","STOT (repeated exposure) – category 2",null,null,3]
[null,null,463,"PCBs (54% Chlorine) (Chlorobiphenyl)","11097-69-1?",null,0.5,null,null,1,null,null,3,3,"3","-","Sk ","STOT (repeated exposure) – category 2",null,null,3]
[null,null,464,"Pentaborane","19624-22-7",5.0000000000000001E-3,1.2999999999999999E-2,null,1.4999999999999999E-2,3.9E-2,null,null,2,2,"2","-","- ","-",null,"CNS convulsions & impairment",4]
[null,null,465,"Pentachloronaphthalene","1321-64-8",null,0.5,null,null,null,null,null,3,3,"3","-","- ","Acute toxicity – category 4\nEye irritation – category 2\nSkin irritation – category 2",null,"Liver damage; chloracne; skin notation",3]
[null,null,466,"Pentachloronitrobenzene (quintozene)","82-68-8",null,0.5,null,null,null,null,null,3,3,"3","-","Sen","Skin sensitisation – category 1",null,"Liver damage",3]
[null,null,467,"Pentachlorophenol","87-86-5",null,0.5,null,null,null,null,null,4,4,"3","Carc. 2","Sk","Carcinogenicity – category 2\nAcute toxicity – category 2\nAcute toxicity – category 3\nSTOT (single exposure) – category 3\nSkin irritation – category 2\nEye irritation – category 2",null,"URT & eye irr; CNS & cardiac impairment",4]
[null,null,468,"Pentaerythritol ","115-77-5",null,10,null,null,null,null,null,"1C","1C","1C","-","-","-",null,"GI irr","1C"]
[null,null,469,"Pentane","109-66-0",600,1770,null,750,2210,null,null,2,2,"2","-","-","STOT (single exposure) – category 3",null,"Narcosis; resp tract irr",4]
[null,null,470,"Perchloroethylene (Tetrachloroethylene)","127-18-4",50,340,null,150,1020,null,null,4,4,"4","-","-","Carcinogenicity – category 2",null,"CNS impairment",4]
[null,null,471,"Perchloromethyl mercaptan","594-42-3",0.1,0.76,null,null,null,null,null,2,2,"2","-","-","-",null,"Eye & URT irr","1B"]
[null,null,472,"Perchloryl fluoride","7616-94-6",3,13,null,6,25,null,null,4,4,"4","-","-","-",null,"LRT & URT irr; MeHb-emia; fluorosis",4]
[null,null,473,"Perfluoroisobutylene (Octafluoroisobutylene)","382-21-8",null,null,null,null,null,0.01,8.2000000000000003E-2,"1A","1A","1A","-","-","-",null,"URT irr; haematologic eff"]
[null,null,474,"Perlite dust ","93763-70-3",null,10,null,null,null,null,null,"1C","1C","1C","-","-","-",null,null,"1C"]
[null,null,475,"Petrol (gasoline)","8002-05-9",null,900,null,null,null,null,null,2,4,"2","-","-","Germ cell mutagenicity – category 1B\nCarcinogenicity – category 1B\nReproductive toxicity – category 2","Has chronic effect as well as acute effects.","URT & eye irr; CNS impairment",2,"Y"]
[null,null,476,"Phenol","108-95-2",1,4,null,null,null,null,null,4,4,"4","-","Sk","Germ cell mutagenicity – category 2\nAcute toxicity – category 3\nSkin corrosion – category 1B\nSTOT (repeated exposure) – category 2",null,"URT irr; lung damage; CNS impairment; skin notation",4]
[null,null,477,"Phenothiazine","92-84-2",null,5,null,null,null,null,null,3,3,"3","-","Sk","-",null,"Eye photosensitisation; skin irr",4]
[null,null,478,"Phenyl ether (vapour) (Diphenyl ether)","101-84-8",1,7,null,2,14,null,null,"1B","1B","1B","-","-","-","SCOEL documentation - URT & eye irr; no acute health hazard","No data","1B"]
[null,null,479,"Phenyl glycidyl ether (PGE; Phenyl-2,3-epoxypropyl ether; Oxirane, (phenoxymethyl)-)","122-60-1",1,6.1,null,null,null,null,null,3,3,"3","Carc. 1B","Sen","Acute toxicity – category 4\nCarcinogenicity – category 1B\nGerm cell mutagenicity – category 2\nEye irritation – category 2A\nSTOT (single exposure) – category 3\nSkin irritation – category 2\nSkin sensitisation – category 1","Has acute effects &  could consider 4 but acute is at warning level,","Testicular damage",4,"M"]
[null,null,480,"Phenyl mercaptan (Benzenethiol)","108-98-5",0.5,2.2999999999999998,null,null,null,null,null,"1B","1B","1B","-","- ","-",null,"CNS impairment; eye & skin irr",4]
[null,null,481,"m-Phenylenediamine (1,3-Benzenediamine)","108-45-2",null,0.1,null,null,null,null,null,3,4,"3","-","Sk:Sen","Germ cell mutagenicity – category 2\nAcute toxicity – category 3\nSkin sensitisation – category 1\nEye irritation – category 2A","Has acute toxic effects as well as chronic effects",null,3,"Y"]
[null,null,482,"o-Phenylenediamine (1,2-Benzenediamine)","95-54-5",null,0.1,null,null,null,null,null,3,4,"3","Carc. 2","Sen","Carcinogenicity – category 2\nGerm cell mutagenicity – category 2\nAcute toxicity – category 3\nAcute toxicity – category 4\nEye irritation – category 2A\nSkin sensitisation – category 1","Has acute effects & could consider 4 but acute inhalation plus toxicity by inhalation is at warning level.","Anemia",4,"Y"]
[null,null,483,"p-Phenylenediamine (1,4-Benzenediamine)","106-50-3",null,0.1,null,null,null,null,null,3,4,"3","-","Sen","Acute toxicity – category 3\nEye irritation – category 2A\nSkin sensitisation – category 1","Acute toxicity is Category 3; implies adjustment category 4","URT irr; skin sensitiser",4,"Y"]
[null,null,484,"Phenylhydrazine","100-63-0",0.1,0.44,null,null,null,null,null,4,4,"3","Carc. 1B","Sk:Sen","Acute toxicity – category 3\nCarcinogenicity – category 1B\nGerm cell mutagenicity – category 2\nEye irritation – category 2A\nSkin irritation – category 2\nSTOT (repeated exposure) – category 1\nSkin sensitisation – category 1",null,"Anemia; URT & skin irr",4]
[null,null,485,"Phenylphosphine","638-21-1",null,null,null,null,null,0.05,0.23,"1A","1A","1A","-","-","-",null,"Dermatitis; haematologic eff; testicular damage","1A"]
[null,null,486,"Phorate (Thimet)","298-02-2",null,0.05,null,null,0.2,null,null,4,4,"4","-","Sk","Acute toxicity – category 1\nAcute toxicity – category 2",null,"Cholinesterase inhibition",4]
[null,null,487,"Phosgene (Carbonyl chloride)","75-44-5",0.02,0.08,null,0.06,0.25,null,null,2,2,"2","-","-","Acute toxicity – category 2\nSkin corrosion – category 1B",null,"URT irr; pulmonary oedema; pulmonary emphysema",4]
[null,null,488,"Phosphine","7803-51-2",0.3,0.42,null,1,1.4,null,null,2,2,"2","-","-","Acute toxicity – category 2\nSkin corrosion – category 1B",null,"URT & GI irr; headache; CNS impairment",4]
[null,null,489,"Phosphoric acid (Orthophosphoric acid)","7664-38-2",null,1,null,null,3,null,null,"1B","1B","1B","-","-","Skin corrosion – category 1B\nAcute toxicity – category 4",null,"URT, eye & skin irr","1B"]
[null,null,490,"Phosphorus (yellow)","7723-14-0",null,0.1,null,null,null,null,null,"1B","1B","1B","-","-","-",null,"LRT, URT & GI irr; liver damage",4]
[null,null,491,"Phosphorus oxychloride (Phosphoryl trichloride)","10025-87-3",0.1,0.63,null,null,null,null,null,"1B",4,"1B","-","-","Acute toxicity – category 2\nSTOT (repeated exposure) – category 1\nAcute toxicity – category 4\nSkin corrosion – category 1A","Should be Cat 4 given GHS STOT hazard category and irritant properties.  ACGIH documentation notes both acute and repeated chronic effects.","URT irr",4,"Y"]
[null,null,492,"Phosphorus pentachloride","10026-13-8",0.1,0.85,null,null,null,null,null,"1B","1B","1B","-","-","Acute toxicity – category 2\nAcute toxicity – category 4\nSTOT (repeated exposure) – category 2\nSkin corrosion – category 1B","Possibly a Cat 4 given GHS STOT hazard category and irritant properties, but ACHIH documentation notes only irritant effects.","URT & eye irr",2,"?"]
[null,null,493,"Phosphorus pentasulphide (Diphosphorous pentasulphide)","1314-80-3",null,1,null,null,3,null,null,"1B","1B","1B","-","-","Acute toxicity – category 4",null,"URT irr","1B"]
[null,null,494,"Phosphorus trichloride","7719-12-2",0.2,1.1000000000000001,null,0.5,2.8,null,null,"1B","1B","1B","-","-","Acute toxicity – category 2\nSTOT (repeated exposure) – category 2\nSkin corrosion – category 1A","Possibly a Cat 4 given GHS STOT hazard category and irritant properties, but ACHIH documentation notes only irritant effects.","URT, eye & skin irr","1B","?"]
[null,null,495,"Phthalic anhydride","85-44-9",1,6.1,null,null,null,null,null,3,3,"3","-","Sen","Acute toxicity – category 4\nSTOT (single exposure) – category 3\nSkin irritation – category 2\nEye damage – category 1\nSkin sensitisation – category 1\nRespiratory sensitisation – category 1",null,"URT, eye & skin irr",4]
[null,null,496,"m-Phthalodinitrile","626-17-5",null,5,null,null,null,null,null,"1C","1C","1C","-","-","-",null,"Eye & URT irr","1B"]
[null,null,497,"Picloram (Tordon)","1918-02-1",null,10,null,null,null,null,null,"1C","1C","1C","-","-","-",null,"Liver & kidney changes - modest, in rats & mice",3]
[null,null,498,"Picric acid (2,4,6-Trinitrophenol)","88-89-1",null,0.1,null,null,null,null,null,3,3,"3","-","-","Acute toxicity – category 3",null,"Skin sensitisation; dermatitis; eye irr",3]
[null,null,499,"Pindone (Pival; 2-Pivalyl-1,3-indandione)","83-26-1",null,0.1,null,null,null,null,null,3,3,"3","-","-","Acute toxicity – category 3\nSTOT (repeated exposure) – category 1",null,"Coagulation",4]
[null,null,500,"Piperazine dihydrochloride","142-64-3",null,5,null,null,null,null,null,3,4,"3","-","Sen","Eye irritation – category 2A\nSkin irritation – category 2\nSTOT (single exposure) – category 1\nSTOT (repeated exposure) – category 2\nRespiratory sensitisation – category 1\nSkin sensitisation – category 1\nReproductive toxicity – category 2","Cat 4 based on acute as well as chronic effects.","Respiratory sensitiser; asthma",4,"Y"]
[null,null,501,"Piperidine","110-89-4",1,3.5,null,null,null,null,null,"1B","1B",null,"-","Sk","Acute toxicity – category 3\nAcute toxicity – category 4\nSkin corrosion – category 1A","UK HSE documentation - eye & URT irr","No data"]
[null,null,502,"Platinum, metal","7440-06-4",null,1,null,null,null,null,null,3,3,"3","-","-","-",null,"Asthma; URT irr",4]
[null,null,503,"Platinum, soluble salts (as Pt)",null,null,2E-3,null,null,null,null,null,3,3,"3","-","Sen","Respiratory sensitisation – category 1\nSkin sensitisation – category 1",null,"Asthma; URT irr",4]
[null,null,504,"Portland cement ","65997-15-1",null,10,null,null,null,null,null,"1B","1B","1B","-","- ","-",null,"Pulmonary function; respiratory symptoms; asthma","1C"]
[null,null,505,"Potassium hydroxide","1310-58-3",null,null,null,null,null,null,2,"1A","1A","1A","-","- ","Acute toxicity – category 4\nSkin corrosion – category 1A",null,"URT, eye & skin irr","1B"]
[null,null,506,"Potassium Persulfate","7727-21-1",null,null,null,null,null,null,0.01,2,2,null,"-","Sen","Acute toxicity – category 4\nSkin irritation – category 2\nEye irritation – category 2A\nRespiratory sensitisation – category 1\nSkin sensitisation – category 1\nSTOT (single exposure) – category 3","NIOSH Int Chem Safety Card - URT irr,  sore throat, wheezing","Skin irr","1B"]
[null,null,507,"Precipitated silica ","112926-00-8",null,10,null,null,null,null,null,"1C","1C","1C","-","- ","-"]
[null,null,508,"Propane-1,2-diol total: (vapour & particulates)","57-55-6",150,474,null,null,null,null,null,2,2,null,"-","-","-","UK HSE documentation - nasal & eye irr; NIOSH Int Chem Safety Card - eye irr; skin sensitisation","No data"]
[null,null,509,"Propane-1,2-diol: particulates only","57-55-6",null,10,null,null,null,null,null,2,2,null,"-","- ","-","UK HSE documentation - nasal & eye irr; NIOSH Int Chem Safety Card - eye irr; skin sensitisation","No data"]
[null,null,510,"Propargyl alcohol (Prop-2-yn-1-ol)","107-19-7",1,2.2999999999999998,null,null,null,null,null,"1B","1B","1B","-","Sk ","Acute toxicity – category 3\nSkin corrosion – category 1B",null,"Eye irr; liver & kidney damage",4]
[null,null,511,"beta-Propiolactone","57-57-8",0.5,1.5,null,null,null,null,null,4,4,"3","Carc. 1B","-","Acute toxicity – category 3\nAcute toxicity – category 1\nCarcinogenicity – category 1B\nGerm cell mutagenicity – category 1B\nEye irritation – category 2A\nSkin irritation – category 2\nSkin sensitisation – category 1",null,"Skin cancer; URT irr",4]
[null,null,512,"Propionic acid","79-09-4",10,30,null,null,null,null,null,"1B","1B","1B","-","-","Acute toxicity – category 3\nAcute toxicity – category 4\nSkin corrosion – category 1B\nSTOT(single exposure) – category 3","Possibly a Cat 2 given GHS STOT hazard category.","Eye, skin & URT irr","1B","?"]
[null,null,513,"Propoxur (PHC, Baygon, Arprocarb)","114-26-1",null,0.5,null,null,null,null,null,4,4,"4","-","-","Acute toxicity – category 3",null,"Cholinesterase inhibition",4]
[null,null,514,"Propranolol","525-66-6",0.188,2,null,0.56499999999999995,6,null,null,2,2,null,"-","-","-","UK HSE documentation - bronchoconstriction in asthmatics","No data"]
[null,null,515,"n-Propyl acetate","109-60-4",200,835,null,250,1040,null,null,"1B","1B","1B","-","-","STOT (single exposure) – category 3\nEye irritation – category 2A","Is an irritant. Does have acute effects & chronic effects, but at warning level only.","Eye & URT irr","1B"]
[null,null,516,"Propyl alcohol (Propan-1-ol)","71-23-8",200,492,null,250,614,null,null,"1B",2,"1B","-","Sk","STOT (single exposure) – category 3\nEye damage – category 1","Sparse documentation, lower level chronic, eye damage Cat 1.  Should be Cat 2 based on ACGIH documentation which based TLV on structure-activity relationship to 2-propanol.","URT & eye irr",2,"Y"]
[null,null,517,"n-Propyl nitrate","627-13-4",25,107,null,40,172,null,null,2,2,"2","-","-","-",null,"Nausea; headache",4]
[null,null,518,"Propylene dichloride (1,2-Dichloropropane)","78-87-5",75,347,null,110,508,null,null,4,4,"4","-","-","Carcinogenicity – category 1B\nAcute toxicity – category 4",null,"URT irr; body weight effect; DSEN notation",4]
[null,null,519,"Propylene glycol dinitrate","6423-43-4",0.05,0.34,null,null,null,null,null,4,4,"4","-","Sk","-",null,"Headache; CNS impairment",2]
[null,null,520,"Propylene glycol monomethyl ether (1-Methoxypropan-2-ol)","107-98-2",100,369,null,150,553,null,null,4,4,"4","-","-","STOT (single exposure) – category 3",null,null,"1B"]
[null,null,521,"Propylene imine (2-methylaziridine)","75-55-8",2,4.7,null,null,null,null,null,3,4,"3","Carc. 1B","Sk","Acute toxicity – category 2\nAcute toxicity – category 1\nCarcinogenicity – category 1B\nGerm cell mutagenicity – category 1B\nSkin corrosion – category 1C","Cat 4 based on acute as well as chronic effects.","URT irr; kidney damage; skin notation",3,"Y"]
[null,null,522,"Propylene oxide (1,2-Epoxypropane; Oxirane, methyl-)","75-56-9",20,48,null,null,null,null,null,4,4,"3","Carc. 1B","-","Acute toxicity – category 4\nGerm cell mutagenicity – category 1B\nSTOT (single exposure) – category 3\nSkin corrosion – category 1B\nCarcinogenicity – category 1B",null,"Eye & URT irr",4]
[null,null,523,"Pyrethrum (Pyrethrins (ISO))","8003-34-7?",null,5,null,null,null,null,null,3,3,"3","-","Sen","Acute toxicity – category 4",null,"Liver damage; LRT irr",3]
[null,null,524,"Pyridine","110-86-1",5,16,null,null,null,null,null,3,3,"3","-","- ","Acute toxicity – category 4\nSkin corrosion – category 1C\nSTOT (repeated exposure) – category 2",null,"Skin irr; liver & kidney damage",4]
[null,null,525,"Quartz (respirable dust)","14808-60-7",null,0.1,null,null,null,null,null,3,3,"3","-","- ","Carcinogenicity – category 1A\nSTOT (repeated exposure) – category 1",null,"Pulm fibrosis; lung cancer",3]
[null,null,526,"Quinone (p-Benzoquinone)","106-51-4",0.1,0.44,null,null,null,null,null,"1B","1B","1B","-","- ","Acute toxicity – category 3\nEye irritation – category 2\nSTOT (single exposure) – category 3\nSkin irritation – category 2","Possibly a Cat 2 given GHS STOT hazard category.","Eye irritation; skin damage","1B","M"]
[null,null,527,"Resorcinol (m-Dihydroxybenzene)","108-46-3",10,45,null,20,90,null,null,2,2,"2","-","- ","Acute toxicity – category 4\nSkin irritation – category 2\nEye irritation – category 2A\nSkin sensitisation – category 1",null,"Eye & skin irr",4]
[null,null,528,"Rhodium, insoluble compounds (as Rh)","7440-16-6",null,1,null,null,null,null,null,"1B","1B","3","-","- ","-",null,"LRT irr",4]
[null,null,529,"Rhodium, metal","7440-16-6",null,1,null,null,null,null,null,"1B","1B","3","-","- ","-",null,"URT irr",4]
[null,null,530,"Rhodium, soluble compounds (as Rh)","7440-16-6",null,0.01,null,null,null,null,null,3,3,"3","-","- ","-",null,"Asthma",4]
[null,null,531,"Ronnel (Fenchlorphos)","299-84-3",null,10,null,null,null,null,null,4,4,"4","-","- ","Acute toxicity – category 4",null,"Cholinesterase inhib",3]
[null,null,532,"Rosin core solder pyrolysis products (as formaldehyde)",null,null,0.1,null,null,null,null,null,3,3,"3","-","- ","Skin sensitisation – category 1",null,"Skin sensitisation; dermatitis; asthma","1C"]
[null,null,533,"Rotenone (commercial)","83-79-4",null,5,null,null,null,null,null,4,2,"4","-","- ","Acute toxicity – category 3\nEye irritation – category 2\nSTOT (single exposure) – category 3\nSkin irritation – category 2","Only acute effects are indicated by GHS hazard classifications and TLV is set to protect against irritation, rhinitis and dermatitis.","URT & eye irr; CNS impairment",4,"Y"]
[null,null,534,"Rouge dust ",null,null,10,null,null,null,null,null,"1C","1C","1C","-","- ","-",null,null,"1C"]
[null,null,535,"Selenium compounds (as Se) excluding hydrogen selenide","7782-49-2",null,0.1,null,null,null,null,null,4,4,"4","-","- ","Acute toxicity – category 3\nSTOT (repeated exposure) – category 2",null,"Eye & URT irr",4]
[null,null,536,"Selenium hexafluoride (as Se)","7783-79-1",0.05,0.16,null,null,null,null,null,4,4,"4","-","- ","-",null,"Pulmonary oedema",4]
[null,null,537,"Sesone (2,4-DES sodium; Crag Herbicide; Sodium 2,4-dichloro phenoxyethyl sulfate)","136-78-7",null,10,null,null,null,null,null,3,3,"3","-","- ","-",null,"GI irr","1C"]
[null,null,538,"Silica – Amorphous - Fume (thermally generated)(respirable dust)",null,null,2,null,null,null,null,null,3,3,"3","-","- ","-",null,null,2]
[null,null,539,"Silica – Crystalline (respirable dust)","7631-86-9",null,0.1,null,null,null,null,null,3,3,"3","-","-","Carcinogenicity – category 1A\nSTOT (repeated exposure) – category 1",null,"Pulm fibrosis; lung cancer",3]
[null,null,540,"Silica gel ","112926-00-8",null,10,null,null,null,null,null,"1C","1C","1C","-","- ","-",null,null,"1C"]
[null,null,541,"Silica, fused","60676-86-0",null,0.1,null,null,null,null,null,3,3,"3","-","- ","-",null,null,3]
[null,null,542,"Silicon ","7440-21-3",null,10,null,null,null,null,null,"1C","1C","1C","-","- ","-",null,null,"1C"]
[null,null,543,"Silicon carbide ","409-21-2",null,10,null,null,null,null,null,"1C","1C","1C","-","- ","-",null,null,"1C"]
[null,null,544,"Silicon tetrahydride (Silane)","7803-62-5",5,6.6,null,null,null,null,null,2,2,"2","-","- ","-",null,"URT irr",4]
[null,null,545,"Silver, metal","7440-22-4",null,0.1,null,null,null,null,null,3,3,"3","-","- ","-",null,null,3]
[null,null,546,"Silver, soluble compounds (as Ag)","7440-22-4",null,0.01,null,null,null,null,null,3,3,"3","-","- ","-",null,null,3]
[null,null,547,"Soapstone ","14378-12-2",null,6,null,null,null,null,null,3,3,"3","-","- ","-",null,null,3]
[null,null,548,"Soapstone (respirable dust)","14378-12-2",null,3,null,null,null,null,null,3,3,"3","-","- ","-",null,null,3]
[null,null,549,"Sodium azide ","26628-22-8",null,null,null,null,null,0.11,0.3,"1A","1A","1A","-","- ","Acute toxicity – category 2",null,"Cardiac impair; lung damage","1A"]
[null,null,550,"Sodium bisulphite (Sodium hydrogen sulphite)","7631-90-5",null,5,null,null,null,null,null,"1B","1B","1B","-","- ","Acute toxicity – category 4\nEye damage – category 1",null,"Skin, eye & URT irr","1B"]
[null,null,551,"Sodium fluoroacetate","62-74-8",null,0.05,null,null,0.15,null,null,2,2,"2","-","Sk ","Acute toxicity – category 1\nAcute toxicity – category 2",null,"CNS impairment; cardiac impairment; nausea",2]
[null,null,552,"Sodium hydroxide","1310-73-2",null,null,null,null,null,null,2,"1A","1A","1A","-","- ","STOT (single exposure) – category 3\nSkin corrosion – category 1A","Could be changed to Cat 2 based on GHS STOT hazard category, but there is no TWA WES.  It is an irritant with only a peak / ceiling value, hence remains Cat 1A.","URT, eye & skin irr","1A","M"]
[null,null,553,"Sodium metabisulphite (Disodium disulphite)","7681-57-4",null,5,null,null,null,null,null,"1B","1B","1B","-","- ","Acute toxicity – category 4\nEye damage – category 1",null,"URT irr","1B"]
[null,null,554,"Sodium persulfate","7775-27-1",null,null,null,null,null,null,0.01,2,"1A",null,"-","Sen","Acute toxicity – category 4\nSkin irritation – category 2\nEye irritation – category 2A\nRespiratory sensitisation – category 1\nSkin sensitisation – category 1\nSTOT (single exposure) – category 3","NIOSH Int Chem Safety Card - URT irr, sore throat, wheezing.  Could be Cat 2 based on GHS acute effects, but there is no TWA WES.  It is an irritant with only a peak / ceiling value, hence must be classified as Cat 1A.","Skin irr","1B","Y"]
[null,null,555,"Starch ","9005-25-8",null,10,null,null,null,null,null,3,3,"3","-","- ","-",null,"Dermatitis","1C"]
[null,null,556,"Stearates ",null,null,10,null,null,null,null,null,"1C","1C","1C","-","- ","-",null,null,"1C"]
[null,null,557,"Stibine (Antimony hydride)","7803-52-3",0.1,0.51,null,null,null,null,null,4,4,"4","-","- ","-",null,"Haemolysis; kidney damage; LRT irr",2]
[null,null,558,"Strychnine","57-24-9",null,0.15,null,null,null,null,null,2,2,"2","-","- ","Acute toxicity – category 1\nAcute toxicity – category 2",null,"CNS impairment",2]
[null,null,559,"Styrene, monomer (Phenylethylene, Vinyl benzene)","100-42-5",50,213,null,100,426,null,null,4,4,"4","-","- ","Reproductive toxicity – category 2\nAcute toxicity – category 4\nSTOT (repeated exposure) – category 1\nSkin irritation – category 2\nEye irritation – category 2 ",null,"CNS impairment; URT irr; peripheral neuropothy",2]
[null,null,560,"Subtilisins (Proteolytic enzymes as 100% pure crystalline enzyme)","1395-21-7",null,null,null,null,null,null,6.0000000000000002E-5,4,"1A","1C","-","Sen ","-","Considering strong irritant effects and there is no TWA WES, only a peak / ceiling value, must be classified as Cat 1A.","Skin, URT & LRT irr; asthma","1A","Y"]
[null,null,561,"Sucrose ","57-50-1",null,10,null,null,null,null,null,"1C","1C","1C","-","- ","-",null,null,"1C"]
[null,null,562,"Sulfotep (TEDP; O,O,O,O-Tetraethyl dithiopyrophosphate)","3689-24-5",7.0000000000000001E-3,0.1,null,null,null,null,null,4,4,"4","-","Sk ","Acute toxicity – category 1\nAcute toxicity – category 2",null,null,4]
[null,null,563,"Sulphur dioxide","7446-09-5",2,5.2,null,5,13,null,null,"1B","1B","1B","-","- ","Acute toxicity – category 3\nSkin corrosion – category 1B",null,"Pulmonary function; LRT irr","1B"]
[null,null,564,"Sulphur hexafluoride","2551-62-4",1000,5970,null,null,null,null,null,"1C","1C","1C","-","- ","-",null,"Asphyxia","1C"]
[null,null,565,"Sulphur monochloride (Disulphur dichloride)","10025-67-9",null,null,null,null,null,1,5.5,"1A","1A","1A","-","- ","Acute toxicity – category 3\nAcute toxicity – category 4\nSkin corrosion – category 1A",null,"URT, eye & skin irr","1A"]
[null,null,566,"Sulphur pentafluoride (Disulphur decafluoride)","5714-22-7",null,null,null,null,null,0.01,0.1,"1A","1A","1A","-","- ","-",null,"URT irr; lung damage","1A"]
[null,null,567,"Sulphur tetrafluoride","7783-60-0",null,null,null,null,null,0.1,0.44,"1A","1A","1A","-","- ","-",null,"Eye & URT irr; lung damage",2]
[null,null,568,"Sulphuric acid","7664-93-9",null,1,null,null,3,null,null,"1B",3,"1B","-","- ","Skin corrosion – category 1A","Cat 4 due to long-term effect (cancer) plus lung effects.","Pulmonary function; A2 carcinogen","1B","Y"]
[null,null,569,"Sulphuryl fluoride","2699-79-8",5,21,null,10,42,null,null,3,3,"3","-","- ","Acute toxicity – category 3\nSTOT (repeated exposure) – category 2",null,"CNS impairment",2]
[null,null,570,"Sulprofos (Bolstar)","35400-43-2",null,1,null,null,null,null,null,4,4,"4","-","- ","-",null,"Cholinesterase inhibition",4]
[null,null,571,"2,4,5-T (2,4,5-Trichlorophenoxyacetic acid)","93-76-5",null,10,null,null,null,null,null,"1C","1C","1C","-","-","Acute toxicity – category 4\nEye irritation – category 2\nSTOT (single exposure) – category 3\nSkin irritation – category 2","Possibly a Cat 2 given GHS STOT hazard category.","PNS impairment","1C","M"]
[null,null,572,"Talc (containing no asbestos fibres)","14807-96-6",null,2.5,null,null,null,null,null,3,3,"3","-","-","-",null,"Pulm fibrosis; pulm function",3]
[null,null,573,"Tantalum, metal & oxide dusts","7440-25-7",null,5,null,null,null,null,null,"1C","1C","1C","-","- ","-",null,null,4]
[null,null,574,"Tellurium & compounds (as Te)","13494-80-9",null,0.1,null,null,null,null,null,4,4,"4","-","- ","-",null,"Haliotosis",4]
[null,null,575,"Tellurium hexafluoride (as Te)","7783-80-4",0.02,0.1,null,null,null,null,null,2,2,"2","-","- ","-",null,"LRT irr",2]
[null,null,576,"Temephos (Abate)","3383-96-8",null,10,null,null,null,null,null,4,4,"4","-","- ","-",null,"Cholinesterase inhibition","1C"]
[null,null,577,"TEPP (Tetraethyl pyrophosphate)","107-49-3",4.0000000000000001E-3,4.7E-2,null,null,null,null,null,4,4,"4","-","Sk ","Acute toxicity – category 1\nAcute toxicity – category 2",null,"Cholinesterase inhibition",4]
[null,null,578,"Terphenyls","26140-60-3",null,null,null,null,null,0.5,4.7,"1A","1A","1A","-","- ","-",null,"URT & eye irr; (potential sensitisation but not confirmed)","1A"]
[null,null,579,"1,1,2,2-Tetrabromoethane (Acetylene tetrabromide)","79-27-6",1,14,null,null,null,null,null,4,4,"4","-","- ","Acute toxicity – category 2\nEye irritation – category 2",null,"Eye & URT irr; pulmonary oedema; liver damage",2]
[null,null,580,"1,1,2,2-Tetrachloro-1,2-difluoroethane","76-12-0",500,4170,null,null,null,null,null,4,4,"4","-","- ","-",null,null,4]
[null,null,581,"1,1,1,2-Tetrachloro-2,2-difluoroethane","76-11-9",500,4170,null,null,null,null,null,4,4,"4","-","- ","-",null,null,4]
[null,null,582,"1,1,2,2-Tetrachloroethane","79-34-5",1,6.9,null,null,null,null,null,4,4,"4","-","Sk ","Acute toxicity – category 1\nAcute toxicity – category 2",null,null,4]
[null,null,583,"Tetrachloronaphthalene","1335-88-2",null,2,null,null,null,null,null,3,3,"3","-","- ",null,null,null,3]
[null,null,584,"Tetraethyl lead (as Pb)","78-00-2",null,0.1,null,null,null,null,null,2,4,"3","-","Sk ","Acute toxicity – category 1\nCarcinogenicity – category 2\nReproductive toxicity – category 1A\nSTOT (repeated exposure) – category 1","Has chronic as well as acute, seems to be clearly a 4. ","CNS impairment; skin notation",4,"Y"]
[null,null,585,"1,1,1,2-Tetrafluoroethane (HFC 134a)","811-97-2",1000,4240,null,null,null,null,null,"1C","1C",null,"-","- ","-","UK HSE documentation - nose & eye irr - low","No data"]
[null,null,586,"Tetrahydrofuran","109-99-9",100,295,null,null,null,null,null,4,3,"1B","-","Sk ","Skin irritation – category 2\nEye irritation – category 2A\nCarcinogenicity – category 2\nSTOT (single exposure) – category 3","Specific organ toxicity, animal cancer - all warning level, could leave at 4, but not clearcut","URT irr; CNS impairment; kidney damage",3,"Y"]
[null,null,587,"Tetramethyl lead (as Pb)","75-74-1",null,0.15,null,null,null,null,null,3,4,"3","-","Sk ","Acute toxicity – category 1\nCarcinogenicity – category 2\nReproductive toxicity – category 1A\nSTOT (repeated exposure) – category 1","Has chronic effects plus acute oral toxicity is highest level (fatal) => Adj category 4","CNS impairment; skin notation",4,"Y"]
[null,null,588,"Tetramethyl succinonitrile","3333-52-6",0.5,2.8,null,null,null,null,null,2,2,"2","-","Sk ","-",null,"Headache; nausea; CNS convulsions",4]
[null,null,589,"Tetranitromethane ","509-14-8",1,8,null,null,null,null,null,4,4,"4","-","- ","-",null,"Eye & URT irr; URT cancer",3]
[null,null,590,"Tetrasodium pyrophosphate","7722-88-5",null,5,null,null,null,null,null,"1B","1B","1B","-","- ","-",null,null,"1B"]
[null,null,591,"Tetryl (2,4,6-Trinitrophenylmethylnitramine; N-Methyl-N-2,4,6-tetranitroaniline)","479-45-8",null,1.5,null,null,null,null,null,3,3,"3","-","Sen ","Acute toxicity – category 3\nSTOT (repeated exposure) – category 2",null,null,3]
[null,null,592,"Thallium, soluble compounds (as Tl)","7440-28-0",null,0.1,null,null,null,null,null,3,3,"3","-","Sk ","Acute toxicity – category 2\nSTOT (repeated exposure) – category 2",null,"GI damage; peripheral neuropathy",4]
[null,null,593,"4,4'-Thiobis (6-tert-butyl-m-cresol)","96-69-5",null,10,null,null,null,null,null,"1C","1C","1C","-","- ","-",null,null,"1C"]
[null,null,594,"Thioglycolic acid (Mercaptoacetic acid)","68-11-1",1,3.8,null,null,null,null,null,"1B",2,"1B","-","Sk ","Acute toxicity – category 3\nAcute toxicity – category 4\nAcute toxicity – category 2\nSkin corrosion – category 1\nSkin sensitisation – category 1\nSTOT (repeated exposure) – category 2","Toxic if swallowed, chronic effects at warning level => Adjmt cat 2","Eye & skin irr; skin notation","1B","Y"]
[null,null,595,"Thionyl chloride (thionyl dichloride)","7719-09-7",null,null,null,null,null,1,4.9000000000000004,"1A","1A","1A","-","- ","Acute toxicity – category 4\nSkin corrosion – category 1A",null,"URT irr; (analogous to HCl)","1A"]
[null,null,596,"Thiram (Tetramethyl thiuram disulphide)","137-26-8",null,1,null,null,null,null,null,3,3,"3","-","Sen","Acute toxicity – category 4\nSkin irritation – category 2\nEye irritation – category 2A\nSkin sensitisation – category 1\nGerm cell mutagenicity – category 2\nSTOT (repeated exposure) – category 2",null,"Body weight & haematological effect",4]
[null,null,597,"Tin, metal","7440-31-5",null,2,null,null,null,null,null,3,3,"3","-","-","-",null,"Pneumoconiosis",3]
[null,null,598,"Tin, organic compounds (as Sn)","7440-31-5",null,0.1,null,null,0.2,null,null,3,3,"3","-","Sk: see Notes","Acute toxicity – category 2\nAcute toxicity – category 3\nAcute toxicity – category 4\nSTOT (repeated exposure) – category 1\nEye irritation – category 2\nSkin irritation – category 2 ",null,"Eye & URT irr; headache; nausea; CNS & immune effects",4]
[null,null,599,"Tin, oxide & inorganic compounds, except SnH4 (as Sn)","7440-31-5",null,2,null,null,null,null,null,3,3,"3","-","-","-",null,null,3]
[null,null,600,"Titanium dioxide ","13463-67-7",null,10,null,null,null,null,null,"1C","1C","1C","-","- ","-",null,null,"1C"]
[null,null,601,"Toluene ","108-88-3",50,191,null,150,574,null,null,4,4,"4","-","Sk ","Skin irritation – category 2\nSTOT (repeated exposure) – category 2\nReproductive toxicity – category 1A",null,"Visual impairment; female repro; pregnancy loss",2]
[null,null,602,"Toluene-2,4-diisocyanate (TDI; 4-methyl-m-phenylene diisocyanate)","584-84-9",null,0.02,null,null,7.0000000000000007E-2,null,null,3,4,"3","Carc. 2","Sen","Carcinogenicity – category 2\nAcute toxicity – category 1\nEye irritation – category 2A\nSTOT (single exposure) – category 3\nRespiratory sensitisation – category 1\nSkin sensitisation – category 1\nSkin irritation – category 2","GHS Cat 1 resp sensitiser and Cat 1 inhalation. Adjmt category Cat 4 appropriate.","Respiratory sensitiser",4,"Y"]
[null,null,603,"m-Toluidine","108-44-1",2,8.8000000000000007,null,null,null,null,null,2,4,"2","-","Sk","Acute toxicity – category 3\nSTOT (repeated exposure) – category 2","Has both acute and chronic effects.","Eye, bladder & kidney irr; MeHb-emia",4,"Y"]
[null,null,604,"o-Toluidine","95-53-4",2,8.8000000000000007,null,null,null,null,null,4,4,"4","Carc. 1B","Sk","STOT (single exposure) – category 1\nCarcinogenicity – category 1A\nGerm cell mutagenicity – category 1B\nEye irritation – category 2A\nSTOT (repeated exposure) – category 2",null,null,4]
[null,null,605,"p-Toluidine","106-49-0",2,8.8000000000000007,null,null,null,null,null,4,4,"4","Carc. 2","Sk","Acute toxicity – category 3\nCarcinogenicity – category 2\nEye irritation – category 2A\nSkin sensitisation – category 1",null,"MeHb-emia",4]
[null,null,606,"Tributyl phosphate (Phosphoric acid, tributyl ester)","126-73-8",0.2,2.2000000000000002,null,null,null,null,null,4,4,"1B","Carc. 2","-","Acute toxicity – category 4\nAcute toxicity – category 3\nCarcinogenicity – category 2\nSkin irritation – category 2",null,"Bladder, eye & URT irr",4]
[null,null,607,"1,1,2-Trichloro-1,2,2-trifluoroethane (Fluorocarbon 113, Freon 113)","76-13-1",1000,7670,null,1250,9590,null,null,2,2,"2","-","-","-",null,"CNS impairment",4]
[null,null,608,"Trichloroacetic acid (TCA)","76-03-9",1,6.7,null,null,null,null,null,"1B","1B","1B","-","-","Skin corrosion – category 1A",null,"Eye & URT irr","1B"]
[null,null,609,"1,2,4-Trichlorobenzene","120-82-1",null,null,null,null,null,5,37,"1A","1A","1B","-","-","Acute toxicity – category 4\nSkin irritation – category 2",null,"Eye & URT irr; ceiling value assigned","1A"]
[null,null,610,"1,1,1-Trichloroethane (Methyl chloroform)","71-55-6",100,555,null,200,1110,null,null,2,2,"2","-","-","Acute toxicity – category 4",null,"CNS impairment; liver damage",4]
[null,null,611,"1,1,2-Trichloroethane","79-00-5",10,55,null,null,null,null,null,4,4,"4","Carc. 2","Sk","Carcinogenicity – category 2\nAcute toxicity – category 4",null,"CNS impairment; liver damage; A3 carcinogen",4]
[null,null,612,"Trichloroethylene (Ethene, trichloro)","79-01-6",10,54,null,40,216,null,null,4,4,"2","Carc. 1B","Sk","Carcinogenicity – category 1B\nGerm cell mutagenicity – category 2\nEye irritation – category 2A\nSkin irritation – category 2\nSTOT (single exposure) – category 3",null,"CNS impairment; cognitive decrements; renal toxicity",4]
[null,null,613,"Trichlorofluoromethane (Fluorocarbon 11, Freon 11, Fluorotrichloromethane)","75-69-4",null,null,null,null,null,1000,5620,"1A","1A","1A","-","-","-",null,"Cardiac sensitisation","1A"]
[null,null,614,"Trichloronaphthalene","1321-65-9",null,5,null,null,null,null,null,3,3,"3","-","Sk","-",null,"Liver damage; chlorachne",4]
[null,null,615,"1,2,3-Trichloropropane","96-18-4",10,60,null,null,null,null,null,4,4,"3","Carc. 1B","Sk","Acute toxicity – category 3\nCarcinogenicity – category 1B\nEye irritation – category 2A\nSTOT (single exposure) – category 3\nSTOT (repeated exposure) – category 2\nReproductive toxicity – category 1B",null,"Cancer; liver & kidney damage; eye & URT irr",4]
[null,null,616,"Tridymite (respirable dust)","15468-32-3",null,0.1,null,null,null,null,null,3,3,"3","-","- ","-",null,null,3]
[null,null,617,"Triethanolamine (Ethanol, 2,2',2''-nitrilotris-)","102-71-6",null,5,null,null,null,null,null,3,"1B","3","-","Sen ","Eye irritation – category 2A\nSkin irritation – category 2\nSTOT (single exposure) – category 3","Is an irritant. Is some reference (ACGIH) to contact dermititis, so could also keep at Cat 3","Eye & skin irr",4,"Y"]
[null,null,618,"Triethylamine (N,N-Diethylethanamine)","121-44-8",2,8,null,4,17,null,null,4,4,"4","-","- ","Acute toxicity – category 4\nAcute toxicity – category 3\nSTOT (single exposure) – category 3\nSkin corrosion – category 1A",null,"Visual impairment; URT irr; skin notation",4]
[null,null,619,"Trifluorobromomethane (Fluorocarbon 13B1, Bromotrifluoromethane)","75-63-8",1000,6090,null,null,null,null,null,"1C","1C","1C","-","- ","-",null,null,"1C"]
[null,null,620,"Triglycidylisocyanurate (TGIC; Araldite PT 810)","2451-62-9",null,0.08,null,null,null,null,null,3,3,"3","-","Sen ","-"]
[null,null,621,"Trimellitic anhydride (Benzene-1,2,4-tricarboxylic acid-1,2-anhydride)","552-30-7",5.0000000000000001E-3,3.9E-2,null,null,null,null,null,3,3,"3","-","Sen ","STOT (single exposure) – category 3\nEye damage – category 1\nRespiratory sensitisation – category 1\nSkin sensitisation – category 1",null,"Respiratory sensitiser","1A"]
[null,null,622,"Trimethyl benzene","25551-13-7",25,123,null,null,null,null,null,3,3,"3","-","- ","-",null,"CNS impairment; asthma; haematological effects",4]
[null,null,623,"Trimethyl phosphite (Phosphorous acid, trimethyl ester)","121-45-9",2,10,null,null,null,null,null,"1B","1B","1B","-","- ","Acute toxicity – category 4\nSTOT (repeated exposure) – category 2","Possibly a Cat 3 given GHS STOT hazard category.",null,"1B","?"]
[null,null,624,"Trimethylamine ","75-50-3",10,24,null,15,36,null,null,"1B","1B","1B","-","- ","Acute toxicity – category 4\nSTOT (single exposure) – category 3\nEye damage – category 1\nSkin irritation – category 2","Possibly a Cat 2 given GHS STOT hazard category.","URT, eye & skin irr","1B","M"]
[null,null,625,"2,4,6-Trinitrotoluene (TNT)","118-96-7",null,0.5,null,null,null,null,null,3,3,"3","-","Sk ","Acute toxicity – category 3\nSTOT (repeated exposure) – category 2",null,"MeHb-emia; liver damage; cataracts",4]
[null,null,626,"Triorthocresyl phosphate (Tri o-tolylphosphate)","78-30-8",null,0.1,null,null,null,null,null,4,4,"3","-","Sk ","STOT (single exposure) – category 1",null,"Neurotoxicity; cholinesterase inhib; skin notation",4]
[null,null,627,"Triphenyl amine","603-34-9",null,5,null,null,null,null,null,"1C","1C","1C","-","- ","-",null,null,4]
[null,null,628,"Triphenyl phosphate","115-86-6",null,3,null,null,null,null,null,4,4,"4","-","- ","-",null,"Cholinesterase inhib",4]
[null,null,629,"Tripoli (Microcrystalline Silica)","1317-95-9",null,0.1,null,null,null,null,null,3,3,"3","-","- ","Carcinogenicity – category 1A\nSTOT (repeated exposure) – category 1",null,null,3]
[null,null,630,"Tungsten, insoluble compounds (as W)","7440-33-7",null,5,null,null,10,null,null,"1C","1C","1C","-","- ","-",null,"LRT irr","1C"]
[null,null,631,"Tungsten, soluble compounds (as W)","7440-33-7",null,1,null,null,3,null,null,2,2,"2","-","- ","-",null,"CNS impairment; pulmonary fibrosis",4]
[null,null,632,"Turpentine (wood)","8006-64-2",100,557,null,null,null,null,null,4,4,"1B","-","Sen ","Acute toxicity – category 4\nEye irritation – category 2\nSkin irritation – category 2\nSkin sensitisation – category 1",null,"URT & skin irr; CNS impair; lung damage",2]
[null,null,633,"Uranium (natural), soluble & insoluble compounds (as H)","7440-61-1",null,0.2,null,null,0.6,null,null,3,3,"3","-","- ","Acute toxicity – category 2\nSTOT (repeated exposure) – category 2",null,"Kidney damage",3]
[null,null,634,"n-Valeraldehyde","110-62-3",50,176,null,null,null,null,null,"1B","1B","1B","-","- ","-",null,"Eye, skin & URT irr","1B"]
[null,null,635,"Vanadium (as V2O5) (divanadium pentaoxide), (respirable dust & fume)","1314-62-1",null,0.05,null,null,null,null,null,"1B",4,"1B","-","- ","Acute toxicity – category 4\nEye damage – category 1\nGerm cell mutagenicity – category 2\nCarcinogenicity – category 2\nReproductive toxicity – category 2\nSTOT (single exposure) – category 3\nSTOT (repeated exposure) – category 1","Has chronic as well as acute, seems to be clearly a 4. ","URT & LRT irr",4,"Y"]
[null,null,636,"Vegetable oil mists (except castor oil, cashew nut or similar irritant oils)",null,null,10,null,null,null,null,null,"1C","1C","1C","-","- ","-",null,null,"1C"]
[null,null,637,"Vinyl acetate ","108-05-4",10,35,null,20,70,null,null,"1B",4,"1B","-","- ","Acute toxicity – category 4\nGerm cell mutagenicity – category 2\nCarcinogenicity – category 2\nSTOT (single exposure) – category 3","Has chronic as well as acute, seems to be clearly a 4. ",null,"1B","Y"]
[null,null,638,"Vinyl bromide (Bromoethylene)","593-60-2",5,22,null,null,null,null,null,3,3,"3","Carc. 1B","-","Germ cell mutagenicity – category 2\nCarcinogenicity – category 1B",null,"Liver cancer",4]
[null,null,639,"Vinyl chloride, monomer (Chloroethylene; Ethene, chloro)","75-01-4",5,13,null,null,null,null,null,3,3,"3","Carc. 1A","-","Carcinogenicity – category 1A\nGerm cell mutagenicity – category 2\nSTOT (repeated exposure) – category 1",null,"Liver cancer; liver damage",4]
[null,null,640,"Vinyl cyclohexene dioxide (1,2-Epoxy-4-(epoxy-ethyl)-cyclohexane)","106-87-6",10,57,null,null,null,null,null,3,3,"3","Carc. 2","Sk","Acute toxicity – category 3\nCarcinogenicity – category 2\nReproductive toxicity – category 2",null,"Female & male repro damage",3]
[null,null,641,"Vinyl toluene (Methyl styrene)","25013-15-4",50,242,null,100,483,null,null,"1B","1B","1B","-","-","-",null,"URT & eye irr","1B"]
[null,null,642,"Vinylidene chloride (1,1-Dichloroethylene)","75-35-4",5,20,null,20,79,null,null,3,3,"3","Carc. 2","-","Acute toxicity – category 4\nEye irritation – category 2A\nCarcinogenicity – category 2\nSTOT (repeated exposure) – category 1",null,"Liver & kidney damage",3]
[null,null,643,"Warfarin","81-81-2",null,0.1,null,null,null,null,null,4,4,"4","-","-","Reproductive toxicity – category 1A\nAcute toxicity – category 1\nAcute toxicity – category 1\nAcute toxicity – category 2\nSTOT (repeated exposure) – category 1",null,"Coagulation",3]
[null,null,644,"Welding fumes (not otherwise classified)",null,null,5,null,null,null,null,null,2,2,"2","-","-","-",null,null,"1B"]
[null,null,645,"White spirits (Stoddard solvent)","8052-41-3",null,790,null,null,null,null,null,4,4,"4","Carc. 1B","-","Carcinogenicity – category 1B\nGerm cell mutagenicity – category 1B\nSTOT (repeated exposure) – category 1",null,"Eye, skin & kidney damage; nausea; CNS impairment",2]
[null,null,646,"Wood dust (certain hardwoods such as beech & oak)",null,null,1,null,null,null,null,null,3,3,"3","-","Sen","-",null,"Asthma; pulm function; URT & LRT irr",3]
[null,null,647,"Wood dust (soft wood)",null,null,5,null,null,10,null,null,3,3,"3","-","Sen ","-",null,"Asthma; pulm function; URT & LRT irr","1C"]
[null,null,648,"Xylene (o-, m-, p- isomers)",null,80,350,null,150,655,null,null,2,2,"2","-","- ","Acute toxicity – category 4\nSTOT (single exposure) – category 3\nSkin irritation – category 2",null,"URT & eye irr; CNS impair","1B"]
[null,null,649,"m-Xylene-alpha,alpha'-diamine (m-Xylylendiamine; 1,3-Benzenedimethanamine)","1477-55-0",null,null,null,null,null,null,0.1,"1A","1A","1A","-","Sk ","-",null,"Eye, skin & GI irr; skin notation","1A"]
[null,null,650,"Xylidine (Dimethylaminobenzene, Aminodimethyl benzene)","1300-73-8",0.5,2.5,null,null,null,null,null,3,3,"3","-","Sk","-",null,"Liver damage; MeHb-emia",3]
[null,null,651,"Yttrium, metal & compounds (as Y)","7440-65-5",null,1,null,null,null,null,null,3,3,"3","-","-","-",null,"Pulmonary fibrosis",3]
[null,null,652,"Zinc chloride (fume)","7646-85-7",null,1,null,null,2,null,null,2,2,"2","-","-","Acute toxicity – category 4\nSkin corrosion – category 1",null,"LRT & URT irr",2]
[null,null,653,"Zinc chromates (as Cr) [11103-86-9, 13530-65-9, 37300-23-5]","13530-65-9",null,0.01,null,null,null,null,null,3,4,"3","Carc. 1A","Sen","Acute toxicity – category 4\nAcute toxicity – category 3\nCarcinogenicity – category 1A\nSTOT (repeated exposure) – category 2\nSkin sensitisation – category 1","Has significant acute as well as toxic effects.","Nasal cancer",3,"Y"]
[null,null,654,"Zinc oxide (dust) ","1314-13-2",null,10,null,null,null,null,null,"1C","1C","1C","-","- ","-",null,"Metal fume fever","1C"]
[null,null,655,"Zinc oxide (fume)","1314-13-2",null,5,null,null,10,null,null,2,2,"2","-","- ","-",null,"Metal fume fever",2]
[null,null,656,"Zirconium compounds (as Zr)","7440-67-7",null,5,null,null,10,null,null,"1C","1C","1C","-","- ","-",null,"Respiratory irr",4]

{"sheet":"Feuil2","index":16,"n_rows":661,"n_cols":48,"rows_kept":661,"cut":false,"hidden":true,"merged":[]}
[null,null,"WES Databases "]
[null,null,null,null,null,null,null,null,null,null,null,null,null,null,null,null,null,null,null,null,null,null,null,null,null,null,null,null,null,null,null,null,null,"Comparison"]
[null,null,"Version 2013",null,null,null,null,null,null,null,null,null,null,null,null,null,null,null,"Version 2016"]
[]
[null,"#","SWA name","CAS","Adj","ppm","mg/m³","f/mL","ppm","mg/m³","f/mL","ppm","mg/m³","f/mL","WES ?","Num",null,"#","SWA name","CAS","Adj","ppm","mg/m³","f/mL","ppm","mg/m³","f/mL","ppm","mg/m³","f/mL","WES ?","Num"]
[null,1,"Acetaldehyde ","75-07-0","1B",20,36,null,50,91,null,null,null,null,{"$f":"IF(COUNTA(F6:H6)=0,\"N\",\"Y\")","v":"Y"},{"$f":"B6","v":1},null,1,"Acetaldehyde ","75-07-0","1B",20,36,null,50,91,null,null,null,null,{"$f":"IF(COUNTA(V6:X6)=0,\"N\",\"Y\")","v":"Y"},{"$f":"R6","v":1},null,{"$f":"IF(C6=S6,\"\",1)","v":""},{"$f":"IF(D6=T6,\"\",1)","v":""},"","","","","","","","","","","","",""]
[null,2,"Acetic acid","64-19-7","1B",10,25,null,15,37,null,null,null,null,"Y",2,null,2,"Acetic acid","64-19-7","1B",10,25,null,15,37,null,null,null,null,"Y",2,null,{"$f":"IF(C7=S7,\"\",1)","v":""},{"$f":"IF(D7=T7,\"\",1)","v":""},{"$f":"IF(E7=U7,\"\",1)","v":""},{"$f":"IF(F7=V7,\"\",1)","v":""},{"$f":"IF(G7=W7,\"\",1)","v":""},{"$f":"IF(H7=X7,\"\",1)","v":""},{"$f":"IF(I7=Y7,\"\",1)","v":""},{"$f":"IF(J7=Z7,\"\",1)","v":""},{"$f":"IF(K7=AA7,\"\",1)","v":""},{"$f":"IF(L7=AB7,\"\",1)","v":""},{"$f":"IF(M7=AC7,\"\",1)","v":""},{"$f":"IF(N7=AD7,\"\",1)","v":""},{"$f":"IF(O7=AE7,\"\",1)","v":""},{"$f":"IF(P7=AF7,\"\",1)","v":""},{"$f":"IF(Q7=AG7,\"\",1)","v":""}]
[null,3,"Acetic anhydride","108-24-7","1A",null,null,null,null,null,null,5,21,null,"N",3,null,3,"Acetic anhydride","108-24-7","1A",null,null,null,null,null,null,5,21,null,"N",3,null,"","","","","","","","","","","","","","",""]
[null,4,"Acetone","67-64-1","1C",500,1185,null,1000,2375,null,null,null,null,"Y",4,null,4,"Acetone","67-64-1","1C",500,1185,null,1000,2375,null,null,null,null,"Y",4,null,"","","","","","","","","","","","","","",""]
[null,5,"Acetonitrile","75-05-8",2,40,67,null,60,101,null,null,null,null,"Y",5,null,5,"Acetonitrile","75-05-8",2,40,67,null,60,101,null,null,null,null,"Y",5,null,"","","","","","","","","","","","","","",""]
[null,6,"Acetylsalicylic acid (Aspirin)","50-78-2",2,null,5,null,null,null,null,null,null,null,"Y",6,null,6,"Acetylsalicylic acid (Aspirin)","50-78-2",2,null,5,null,null,null,null,null,null,null,"Y",6,null,"","","","","","","","","","","","","","",""]
[null,7,"Acrolein","107-02-8","1B",0.1,0.23,null,0.3,0.69,null,null,null,null,"Y",7,null,7,"Acrolein","107-02-8","1B",0.1,0.23,null,0.3,0.69,null,null,null,null,"Y",7,null,"","","","","","","","","","","","","","",""]
[null,8,"Acrylamide (Acrylaldehyde)","79-06-1",3,null,0.03,null,null,null,null,null,null,null,"Y",8,null,8,"Acrylamide (Acrylaldehyde)","79-06-1",3,null,0.03,null,null,null,null,null,null,null,"Y",8,null,"","","","","","","","","","","","","","",""]
[null,9,"Acrylic acid","79-10-7",4,2,5.9,null,null,null,null,null,null,null,"Y",9,null,9,"Acrylic acid","79-10-7",4,2,5.9,null,null,null,null,null,null,null,"Y",9,null,"","","","","","","","","","","","","","",""]
[null,10,"Acrylonitrile (Vinyl cyanide)","107-13-1",4,2,4.3,null,null,null,null,null,null,null,"Y",10,null,10,"Acrylonitrile (Vinyl cyanide)","107-13-1",4,2,4.3,null,null,null,null,null,null,null,"Y",10,null,"","","","","","","","","","","","","","",""]
[null,11,"Aldrin","309-00-2",4,null,0.25,null,null,null,null,null,null,null,"Y",11,null,11,"Aldrin","309-00-2",4,null,0.25,null,null,null,null,null,null,null,"Y",11,null,"","","","","","","","","","","","","","",""]
[null,12,"Allyl alcohol","107-18-6",2,2,4.8,null,4,9.5,null,null,null,null,"Y",12,null,12,"Allyl alcohol","107-18-6",2,2,4.8,null,4,9.5,null,null,null,null,"Y",12,null,"","","","","","","","","","","","","","",""]
[null,13,"Allyl chloride (3-Chloro-1-propene)","107-05-1",4,1,3,null,2,6,null,null,null,null,"Y",13,null,13,"Allyl chloride (3-Chloro-1-propene)","107-05-1",4,1,3,null,2,6,null,null,null,null,"Y",13,null,"","","","","","","","","","","","","","",""]
[null,14,"Allyl glycidyl ether (AGE) (Allyl 2,3-epoxypropyl ether)","106-92-3",4,5,23,null,10,47,null,null,null,null,"Y",14,null,14,"Allyl glycidyl ether (AGE) (Allyl 2,3-epoxypropyl ether)","106-92-3",4,5,23,null,10,47,null,null,null,null,"Y",14,null,"","","","","","","","","","","","","","",""]
[null,15,"Allyl propyl disulfide","2179-59-1","1B",2,12,null,3,18,null,null,null,null,"Y",15,null,15,"Allyl propyl disulfide","2179-59-1","1B",2,12,null,3,18,null,null,null,null,"Y",15,null,"","","","","","","","","","","","","","",""]
[null,16,"Aluminium (metal dust)","7429-90-5","1C",null,10,null,null,null,null,null,null,null,"Y",16,null,16,"Aluminium (metal dust)","7429-90-5","1C",null,10,null,null,null,null,null,null,null,"Y",16,null,"","","","","","","","","","","","","","",""]
[null,17,"Aluminium (welding fumes) (as Al)","7429-90-5","1C",null,5,null,null,null,null,null,null,null,"Y",17,null,17,"Aluminium (welding fumes) (as Al)","7429-90-5","1C",null,5,null,null,null,null,null,null,null,"Y",17,null,"","","","","","","","","","","","","","",""]
[null,18,"Aluminium oxide (alpha-Alumina (Al2O3))","1344-28-1","1C",null,10,null,null,null,null,null,null,null,"Y",18,null,18,"Aluminium oxide (alpha-Alumina (Al2O3))","1344-28-1","1C",null,10,null,null,null,null,null,null,null,"Y",18,null,"","","","","","","","","","","","","","",""]
[null,19,"Aluminium, alkyls (NOC) (as Al)","7429-90-5","1B",null,2,null,null,null,null,null,null,null,"Y",19,null,19,"Aluminium, alkyls (NOC) (as Al)","7429-90-5","1B",null,2,null,null,null,null,null,null,null,"Y",19,null,"","","","","","","","","","","","","","",""]
[null,20,"Aluminium, pyro powders (as Al)","7429-90-5","1C",null,5,null,null,null,null,null,null,null,"Y",20,null,20,"Aluminium, pyro powders (as Al)","7429-90-5","1C",null,5,null,null,null,null,null,null,null,"Y",20,null,"","","","","","","","","","","","","","",""]
[null,21,"Aluminium, soluble salts (as Al)","7429-90-5","1B",null,2,null,null,null,null,null,null,null,"Y",21,null,21,"Aluminium, soluble salts (as Al)","7429-90-5","1B",null,2,null,null,null,null,null,null,null,"Y",21,null,"","","","","","","","","","","","","","",""]
[null,22,"2-Aminopyridine (2-Pyridylamine)","504-29-0",2,0.5,2,null,null,null,null,null,null,null,"Y",22,null,22,"2-Aminopyridine (2-Pyridylamine)","504-29-0",2,0.5,2,null,null,null,null,null,null,null,"Y",22,null,"","","","","","","","","","","","","","",""]
[null,23,"Amitrole (3-Amino-1,2,4-triazole)","61-82-5",3,null,0.2,null,null,null,null,null,null,null,"Y",23,null,23,"Amitrole (3-Amino-1,2,4-triazole)","61-82-5",3,null,0.2,null,null,null,null,null,null,null,"Y",23,null,"","","","","","","","","","","","","","",""]
[null,24,"Ammonia","7664-41-7","1B",25,17,null,35,24,null,null,null,null,"Y",24,null,24,"Ammonia","7664-41-7","1B",25,17,null,35,24,null,null,null,null,"Y",24,null,"","","","","","","","","","","","","","",""]
[null,25,"Ammonium chloride (fume)","12125-02-9","1B",null,10,null,null,20,null,null,null,null,"Y",25,null,25,"Ammonium chloride (fume)","12125-02-9","1B",null,10,null,null,20,null,null,null,null,"Y",25,null,"","","","","","","","","","","","","","",""]
[null,26,"Ammonium perfluorooctanoate ","3825-26-1",3,null,0.1,null,null,null,null,null,null,null,"Y",26,null,26,"Ammonium perfluorooctanoate ","3825-26-1",3,null,0.1,null,null,null,null,null,null,null,"Y",26,null,"","","","","","","","","","","","","","",""]
[null,27,"Ammonium Persulfate","7727-54-0",2,null,null,null,null,null,null,null,0.01,null,"N",27,null,27,"Ammonium Persulfate","7727-54-0",2,null,null,null,null,null,null,null,0.01,null,"N",27,null,"","","","","","","","","","","","","","",""]
[null,28,"Ammonium sulphamate (Ammate)","7773-06-0","1B",null,10,null,null,null,null,null,null,null,"Y",28,null,28,"Ammonium sulphamate (Ammate)","7773-06-0","1B",null,10,null,null,null,null,null,null,null,"Y",28,null,"","","","","","","","","","","","","","",""]
[null,29,"n-Amyl acetate (Pentyl acetate)","628-63-7","1B",50,270,null,100,541,null,null,null,null,"Y",29,null,29,"n-Amyl acetate (Pentyl acetate)","628-63-7","1B",50,270,null,100,541,null,null,null,null,"Y",29,null,"","","","","","","","","","","","","","",""]
[null,30,"sec-Amyl acetate (1-Methylbutyl acetate)","626-38-0","1B",50,270,null,100,541,null,null,null,null,"Y",30,null,30,"sec-Amyl acetate (1-Methylbutyl acetate)","626-38-0","1B",50,270,null,100,541,null,null,null,null,"Y",30,null,"","","","","","","","","","","","","","",""]
[null,31,"Aniline & homologues","62-53-3",4,2,7.6,null,null,null,null,null,null,null,"Y",31,null,31,"Aniline & homologues","62-53-3",4,2,7.6,null,null,null,null,null,null,null,"Y",31,null,"","","","","","","","","","","","","","",""]
[null,32,"Anisidine (o-, p- isomers) (Methoxyaniline)","29191-52-4",4,0.1,0.5,null,null,null,null,null,null,null,"Y",32,null,32,"Anisidine (o-, p- isomers) (Methoxyaniline)","29191-52-4",4,0.1,0.5,null,null,null,null,null,null,null,"Y",32,null,"","","","","","","","","","","","","","",""]
[null,33,"Antimony & compounds (as Sb)","7440-36-0",3,null,0.5,null,null,null,null,null,null,null,"Y",33,null,33,"Antimony & compounds (as Sb)","7440-36-0",3,null,0.5,null,null,null,null,null,null,null,"Y",33,null,"","","","","","","","","","","","","","",""]
[null,34,"Antimony trioxide, handling and use (as Sb)","1309-64-4",3,null,0.5,null,null,null,null,null,null,null,"Y",34,null,34,"Antimony trioxide, handling and use (as Sb)","1309-64-4",3,null,0.5,null,null,null,null,null,null,null,"Y",34,null,"","","","","","","","","","","","","","",""]
[null,35,"ANTU (1-Naphthylthiourea)","86-88-4",2,null,0.3,null,null,null,null,null,null,null,"Y",35,null,35,"ANTU (1-Naphthylthiourea)","86-88-4",2,null,0.3,null,null,null,null,null,null,null,"Y",35,null,"","","","","","","","","","","","","","",""]
[null,36,"Arsenic & soluble compounds (as As)","7440-38-2",3,null,0.05,null,null,null,null,null,null,null,"Y",36,null,36,"Arsenic & soluble compounds (as As)","7440-38-2",3,null,0.05,null,null,null,null,null,null,null,"Y",36,null,"","","","","","","","","","","","","","",""]
[null,37,"Arsine","7784-42-1",4,0.05,0.16,null,null,null,null,null,null,null,"Y",37,null,37,"Arsine","7784-42-1",4,0.05,0.16,null,null,null,null,null,null,null,"Y",37,null,"","","","","","","","","","","","","","",""]
[null,38,"Asbestos - Any mixture of commercial species, or where the composition is unknown","1332-21-4",3,null,null,0.1,null,null,null,null,null,null,"Y",38,null,38,"Asbestos - Any mixture of commercial species, or where the composition is unknown","1332-21-4",3,null,null,0.1,null,null,null,null,null,null,"Y",38,null,"","","","","","","","","","","","","","",""]
[null,39,"Asbestos - Amosite ","12172-73-5",3,null,null,0.1,null,null,null,null,null,null,"Y",39,null,39,"Asbestos - Amosite ","12172-73-5",3,null,null,0.1,null,null,null,null,null,null,"Y",39,null,"","","","","","","","","","","","","","",""]
[null,40,"Asbestos - Chrysotile ","12001-29-5",3,null,null,0.1,null,null,null,null,null,null,"Y",40,null,40,"Asbestos - Chrysotile ","12001-29-5",3,null,null,0.1,null,null,null,null,null,null,"Y",40,null,"","","","","","","","","","","","","","",""]
[null,41,"Asbestos - Crocidolite ","12001-28-4",3,null,null,0.1,null,null,null,null,null,null,"Y",41,null,41,"Asbestos - Crocidolite ","12001-28-4",3,null,null,0.1,null,null,null,null,null,null,"Y",41,null,"","","","","","","","","","","","","","",""]
[null,42,"Asbestos - Other forms ",null,3,null,null,0.1,null,null,null,null,null,null,"Y",42,null,42,"Asbestos - Other forms ",null,3,null,null,0.1,null,null,null,null,null,null,"Y",42,null,"","","","","","","","","","","","","","",""]
[null,43,"Atrazine","1912-24-9",2,null,5,null,null,null,null,null,null,null,"Y",43,null,43,"Atrazine","1912-24-9",2,null,5,null,null,null,null,null,null,null,"Y",43,null,"","","","","","","","","","","","","","",""]
[null,44,"Azinphos-methyl (Guthion)","86-50-0",4,null,0.2,null,null,null,null,null,null,null,"Y",44,null,44,"Azinphos-methyl (Guthion)","86-50-0",4,null,0.2,null,null,null,null,null,null,null,"Y",44,null,"","","","","","","","","","","","","","",""]
[null,45,"Barium sulphate ","7727-43-7",3,null,10,null,null,null,null,null,null,null,"Y",45,null,45,"Barium sulphate ","7727-43-7",3,null,10,null,null,null,null,null,null,null,"Y",45,null,"","","","","","","","","","","","","","",""]
[null,46,"Barium, soluble compounds (as Ba)","7440-39-3",2,null,0.5,null,null,null,null,null,null,null,"Y",46,null,46,"Barium, soluble compounds (as Ba)","7440-39-3",2,null,0.5,null,null,null,null,null,null,null,"Y",46,null,"","","","","","","","","","","","","","",""]
[null,47,"Benomyl (Benlate)","17804-35-2",4,0.84,10,null,null,null,null,null,null,null,"Y",47,null,47,"Benomyl (Benlate)","17804-35-2",4,0.84,10,null,null,null,null,null,null,null,"Y",47,null,"","","","","","","","","","","","","","",""]
[null,48,"Benzene","71-43-2",3,1,3.2,null,null,null,null,null,null,null,"Y",48,null,48,"Benzene","71-43-2",3,1,3.2,null,null,null,null,null,null,null,"Y",48,null,"","","","","","","","","","","","","","",""]
[null,49,"Benzoyl peroxide (Dibenzoyl peroxide)","94-36-0","1B",null,5,null,null,null,null,null,null,null,"Y",49,null,49,"Benzoyl peroxide (Dibenzoyl peroxide)","94-36-0","1B",null,5,null,null,null,null,null,null,null,"Y",49,null,"","","","","","","","","","","","","","",""]
[null,50,"Benzyl chloride (alpha-Chlorotoluene)","100-44-7",4,1,5.2,null,null,null,null,null,null,null,"Y",50,null,50,"Benzyl chloride (alpha-Chlorotoluene)","100-44-7",4,1,5.2,null,null,null,null,null,null,null,"Y",50,null,"","","","","","","","","","","","","","",""]
[null,51,"Beryllium & compounds","7440-41-7",3,null,2E-3,null,null,null,null,null,null,null,"Y",51,null,51,"Beryllium & compounds","7440-41-7",3,null,2E-3,null,null,null,null,null,null,null,"Y",51,null,"","","","","","","","","","","","","","",""]
[null,52,"Biphenyl (Diphenyl, Phenylbenzene)","92-52-4",3,0.2,1.3,null,null,null,null,null,null,null,"Y",52,null,52,"Biphenyl (Diphenyl, Phenylbenzene)","92-52-4",3,0.2,1.3,null,null,null,null,null,null,null,"Y",52,null,"","","","","","","","","","","","","","",""]
[null,53,"Bismuth telluride (Dibismuth tritelluride)","1304-82-1","1C",null,10,null,null,null,null,null,null,null,"Y",53,null,53,"Bismuth telluride (Dibismuth tritelluride)","1304-82-1","1C",null,10,null,null,null,null,null,null,null,"Y",53,null,"","","","","","","","","","","","","","",""]
[null,54,"Bismuth telluride, Se-doped","1304-82-1",3,null,5,null,null,null,null,null,null,null,"Y",54,null,54,"Bismuth telluride, Se-doped","1304-82-1",3,null,5,null,null,null,null,null,null,null,"Y",54,null,"","","","","","","","","","","","","","",""]
[null,55,"Bitumen fumes (Asphalt (petroleum))","8052-42-4",4,null,5,null,null,null,null,null,null,null,"Y",55,null,55,"Bitumen fumes (Asphalt (petroleum))","8052-42-4",4,null,5,null,null,null,null,null,null,null,"Y",55,null,"","","","","","","","","","","","","","",""]
[null,56,"Borates, tetra, sodium salts (anhydrous) (Disodium tetraborate anhydrous)","1330-43-4","1B",null,1,null,null,null,null,null,null,null,"Y",56,null,56,"Borates, tetra, sodium salts (anhydrous) (Disodium tetraborate anhydrous)","1330-43-4","1B",null,1,null,null,null,null,null,null,null,"Y",56,null,"","","","","","","","","","","","","","",""]
[null,57,"Borates, tetra, sodium salts (decahydrate) (Disodium tetraborate decahydrate, Borax)","1303-96-4","1B",null,5,null,null,null,null,null,null,null,"Y",57,null,57,"Borates, tetra, sodium salts (decahydrate) (Disodium tetraborate decahydrate, Borax)","1303-96-4","1B",null,5,null,null,null,null,null,null,null,"Y",57,null,"","","","","","","","","","","","","","",""]
[null,58,"Borates, tetra, sodium salts (pentahydrate) (Disodium tetraborate pentahydrate)","12179-04-3","1B",null,1,null,null,null,null,null,null,null,"Y",58,null,58,"Borates, tetra, sodium salts (pentahydrate) (Disodium tetraborate pentahydrate)","12179-04-3","1B",null,1,null,null,null,null,null,null,null,"Y",58,null,"","","","","","","","","","","","","","",""]
[null,59,"Boron oxide (Diboron trioxide)","1303-86-2","1B",null,10,null,null,null,null,null,null,null,"Y",59,null,59,"Boron oxide (Diboron trioxide)","1303-86-2","1B",null,10,null,null,null,null,null,null,null,"Y",59,null,"","","","","","","","","","","","","","",""]
[null,60,"Boron tribromide","10294-33-4","1A",null,null,null,null,null,null,1,10,null,"N",60,null,60,"Boron tribromide","10294-33-4","1A",null,null,null,null,null,null,1,10,null,"N",60,null,"","","","","","","","","","","","","","",""]
[null,61,"Boron trifluoride","7637-07-2","1A",null,null,null,null,null,null,1,2.8,null,"N",61,null,61,"Boron trifluoride","7637-07-2","1A",null,null,null,null,null,null,1,2.8,null,"N",61,null,"","","","","","","","","","","","","","",""]
[null,62,"Bromacil","314-40-9",3,1,11,null,null,null,null,null,null,null,"Y",62,null,62,"Bromacil","314-40-9",3,1,11,null,null,null,null,null,null,null,"Y",62,null,"","","","","","","","","","","","","","",""]
[null,63,"Bromine","7726-95-6","1B",0.1,0.66,null,0.3,2,null,null,null,null,"Y",63,null,63,"Bromine","7726-95-6","1B",0.1,0.66,null,0.3,2,null,null,null,null,"Y",63,null,"","","","","","","","","","","","","","",""]
[null,64,"Bromine pentafluoride","7789-30-2","1B",0.1,0.72,null,null,null,null,null,null,null,"Y",64,null,64,"Bromine pentafluoride","7789-30-2","1B",0.1,0.72,null,null,null,null,null,null,null,"Y",64,null,"","","","","","","","","","","","","","",""]
[null,65,"Bromoform (Tribromomethane)","75-25-2",4,0.5,5.2,null,null,null,null,null,null,null,{"$f":"IF(COUNTA(F70:H70)=0,\"N\",\"Y\")","v":"Y"},{"$f":"B70","v":65},null,65,"Bromoform (Tribromomethane)","75-25-2",4,0.5,5.2,null,null,null,null,null,null,null,{"$f":"IF(COUNTA(V70:X70)=0,\"N\",\"Y\")","v":"Y"},{"$f":"R70","v":65},null,"","","","","","","","","","","","","","",""]
[null,66,"1,3-Butadiene ","106-99-0",3,10,22,null,null,null,null,null,null,null,"Y",66,null,66,"1,3-Butadiene ","106-99-0",3,10,22,null,null,null,null,null,null,null,"Y",66,null,{"$f":"IF(C71=S71,\"\",1)","v":""},{"$f":"IF(D71=T71,\"\",1)","v":""},{"$f":"IF(E71=U71,\"\",1)","v":""},{"$f":"IF(F71=V71,\"\",1)","v":""},{"$f":"IF(G71=W71,\"\",1)","v":""},{"$f":"IF(H71=X71,\"\",1)","v":""},{"$f":"IF(I71=Y71,\"\",1)","v":""},{"$f":"IF(J71=Z71,\"\",1)","v":""},{"$f":"IF(K71=AA71,\"\",1)","v":""},{"$f":"IF(L71=AB71,\"\",1)","v":""},{"$f":"IF(M71=AC71,\"\",1)","v":""},{"$f":"IF(N71=AD71,\"\",1)","v":""},{"$f":"IF(O71=AE71,\"\",1)","v":""},{"$f":"IF(P71=AF71,\"\",1)","v":""},{"$f":"IF(Q71=AG71,\"\",1)","v":""}]
[null,67,"Butane","106-97-8","1C",800,1900,null,null,null,null,null,null,null,"Y",67,null,67,"Butane","106-97-8","1C",800,1900,null,null,null,null,null,null,null,"Y",67,null,"","","","","","","","","","","","","","",""]
[null,68,"2-Butoxyethanol (Butyl cellosolve, Butyl glycol, Ethylene glycol)","111-76-2","1B",20,96.9,null,50,242,null,null,null,null,"Y",68,null,68,"2-Butoxyethanol (Butyl cellosolve, Butyl glycol, Ethylene glycol)","111-76-2","1B",20,96.9,null,50,242,null,null,null,null,"Y",68,null,"","","","","","","","","","","","","","",""]
[null,69,"2-Butoxyethyl acetate","112-07-2","1B",20,133,null,50,333,null,null,null,null,"Y",69,null,69,"2-Butoxyethyl acetate","112-07-2","1B",20,133,null,50,333,null,null,null,null,"Y",69,null,"","","","","","","","","","","","","","",""]
[null,70,"n-Butyl acetate","123-86-4","1B",150,713,null,200,950,null,null,null,null,"Y",70,null,70,"n-Butyl acetate","123-86-4","1B",150,713,null,200,950,null,null,null,null,"Y",70,null,"","","","","","","","","","","","","","",""]
[null,71,"sec-Butyl acetate","105-46-4","1B",200,950,null,null,null,null,null,null,null,"Y",71,null,71,"sec-Butyl acetate","105-46-4","1B",200,950,null,null,null,null,null,null,null,"Y",71,null,"","","","","","","","","","","","","","",""]
[null,72,"tert-Butyl acetate","540-88-5","1B",200,950,null,null,null,null,null,null,null,"Y",72,null,72,"tert-Butyl acetate","540-88-5","1B",200,950,null,null,null,null,null,null,null,"Y",72,null,"","","","","","","","","","","","","","",""]
[null,73,"n-Butyl acrylate (Acrylic acid, n-butyl ester)","141-32-2",4,1,5,null,5,26,null,null,null,null,"Y",73,null,73,"n-Butyl acrylate (Acrylic acid, n-butyl ester)","141-32-2",4,1,5,null,5,26,null,null,null,null,"Y",73,null,"","","","","","","","","","","","","","",""]
[null,74,"n-Butyl alcohol (n-Butanol)","71-36-3","1A",null,null,null,null,null,null,50,152,null,"N",74,null,74,"n-Butyl alcohol (n-Butanol)","71-36-3","1A",null,null,null,null,null,null,50,152,null,"N",74,null,"","","","","","","","","","","","","","",""]
[null,75,"sec-Butyl alcohol (sec-Butanol, Butan-2-ol)","78-92-2",2,100,303,null,null,null,null,null,null,null,"Y",75,null,75,"sec-Butyl alcohol (sec-Butanol, Butan-2-ol)","78-92-2",2,100,303,null,null,null,null,null,null,null,"Y",75,null,"","","","","","","","","","","","","","",""]
[null,76,"tert-Butyl alcohol (tert-Butanol, 2-Methylpropan-2-ol)","75-65-0",2,100,303,null,150,455,null,null,null,null,"Y",76,null,76,"tert-Butyl alcohol (tert-Butanol, 2-Methylpropan-2-ol)","75-65-0",2,100,303,null,150,455,null,null,null,null,"Y",76,null,"","","","","","","","","","","","","","",""]
[null,77,"tert-Butyl chromate (as CrO3)","1189-85-1","1A",null,null,null,null,null,null,null,0.1,null,"N",77,null,77,"tert-Butyl chromate (as CrO3)","1189-85-1","1A",null,null,null,null,null,null,null,0.1,null,"N",77,null,"","","","","","","","","","","","","","",""]
[null,78,"n-Butyl glycidyl ether (BGE) (1-Butoxy-2,3-epoxypropane, Butyl-2,3-epoxypropyl ether)","2426-08-6",3,25,133,null,null,null,null,null,null,null,"Y",78,null,78,"n-Butyl glycidyl ether (BGE) (1-Butoxy-2,3-epoxypropane, Butyl-2,3-epoxypropyl ether)","2426-08-6",3,25,133,null,null,null,null,null,null,null,"Y",78,null,"","","","","","","","","","","","","","",""]
[null,79,"n-Butyl lactate","138-22-7","1B",5,30,null,null,null,null,null,null,null,"Y",79,null,79,"n-Butyl lactate","138-22-7","1B",5,30,null,null,null,null,null,null,null,"Y",79,null,"","","","","","","","","","","","","","",""]
[null,80,"Butyl mercaptan (Butanethiol)","109-79-5","1B",0.5,1.8,null,null,null,null,null,null,null,"Y",80,null,80,"Butyl mercaptan (Butanethiol)","109-79-5","1B",0.5,1.8,null,null,null,null,null,null,null,"Y",80,null,"","","","","","","","","","","","","","",""]
[null,81,"Butylamine","109-73-9","1A",null,null,null,null,null,null,5,15,null,"N",81,null,81,"Butylamine","109-73-9","1A",null,null,null,null,null,null,5,15,null,"N",81,null,"","","","","","","","","","","","","","",""]
[null,82,"o-sec-Butylphenol","89-72-5","1B",5,31,null,null,null,null,null,null,null,"Y",82,null,82,"o-sec-Butylphenol","89-72-5","1B",5,31,null,null,null,null,null,null,null,"Y",82,null,"","","","","","","","","","","","","","",""]
[null,83,"p-tert-Butyltoluene ","98-51-1",3,10,61,null,20,121,null,null,null,null,"Y",83,null,83,"p-tert-Butyltoluene ","98-51-1",3,10,61,null,20,121,null,null,null,null,"Y",83,null,"","","","","","","","","","","","","","",""]
[null,84,"Cadmium and compounds (as Cd)","7440-43-9",3,null,0.01,null,null,null,null,null,null,null,"Y",84,null,84,"Cadmium and compounds (as Cd)","7440-43-9",3,null,0.01,null,null,null,null,null,null,null,"Y",84,null,"","","","","","","","","","","","","","",""]
[null,85,"Caesium hydroxide","21351-79-1","1B",null,2,null,null,null,null,null,null,null,"Y",85,null,85,"Caesium hydroxide","21351-79-1","1B",null,2,null,null,null,null,null,null,null,"Y",85,null,"","","","","","","","","","","","","","",""]
[null,86,"Calcium carbonate (Limestone, Marble)","471-34-1","1C",null,10,null,null,null,null,null,null,null,"Y",86,null,86,"Calcium carbonate (Limestone, Marble)","471-34-1","1C",null,10,null,null,null,null,null,null,null,"Y",86,null,"","","","","","","","","","","","","","",""]
[null,87,"Calcium cyanamide (Calcium carbimide)","156-62-7","1B",null,0.5,null,null,null,null,null,null,null,"Y",87,null,87,"Calcium cyanamide (Calcium carbimide)","156-62-7","1B",null,0.5,null,null,null,null,null,null,null,"Y",87,null,"","","","","","","","","","","","","","",""]
[null,88,"Calcium hydroxide","1305-62-0","1B",null,5,null,null,null,null,null,null,null,"Y",88,null,88,"Calcium hydroxide","1305-62-0","1B",null,5,null,null,null,null,null,null,null,"Y",88,null,"","","","","","","","","","","","","","",""]
[null,89,"Calcium oxide","1305-78-8","1B",null,2,null,null,null,null,null,null,null,"Y",89,null,89,"Calcium oxide","1305-78-8","1B",null,2,null,null,null,null,null,null,null,"Y",89,null,"","","","","","","","","","","","","","",""]
[null,90,"Calcium silicate ","1344-95-2","1C",null,10,null,null,null,null,null,null,null,"Y",90,null,90,"Calcium silicate ","1344-95-2","1C",null,10,null,null,null,null,null,null,null,"Y",90,null,"","","","","","","","","","","","","","",""]
[null,91,"Calcium sulphate (Gypsum, Plaster of Paris)","7778-18-9","1C",null,10,null,null,null,null,null,null,null,"Y",91,null,91,"Calcium sulphate (Gypsum, Plaster of Paris)","7778-18-9","1C",null,10,null,null,null,null,null,null,null,"Y",91,null,"","","","","","","","","","","","","","",""]
[null,92,"Camphor, synthetic (Bornan-2-one)","76-22-2","1B",2,12,null,3,19,null,null,null,null,"Y",92,null,92,"Camphor, synthetic (Bornan-2-one)","76-22-2","1B",2,12,null,3,19,null,null,null,null,"Y",92,null,"","","","","","","","","","","","","","",""]
[null,93,"e-Caprolactam (dust and vapour) (1,6-Hexanelactam, Hexahydro-2H-azepin-2-one)","105-60-2","1B",null,10,null,null,20,null,null,null,null,"Y",93,null,93,"e-Caprolactam (dust and vapour) (1,6-Hexanelactam, Hexahydro-2H-azepin-2-one)","105-60-2","1B",null,10,null,null,20,null,null,null,null,"Y",93,null,"","","","","","","","","","","","","","",""]
[null,94,"Caprolactam (dust)","105-60-2","1B",null,1,null,null,3,null,null,null,null,"Y",94,null,94,"Caprolactam (dust)","105-60-2","1B",null,1,null,null,3,null,null,null,null,"Y",94,null,"","","","","","","","","","","","","","",""]
[null,95,"Captafol (Difolatan)","2425-06-1",4,null,0.1,null,null,null,null,null,null,null,"Y",95,null,95,"Captafol (Difolatan)","2425-06-1",4,null,0.1,null,null,null,null,null,null,null,"Y",95,null,"","","","","","","","","","","","","","",""]
[null,96,"Captan","133-06-2",4,null,0.5,null,null,null,null,null,null,null,"Y",96,null,96,"Captan","133-06-2",4,null,0.5,null,null,null,null,null,null,null,"Y",96,null,"","","","","","","","","","","","","","",""]
[null,97,"Carbaryl (Sevin)","63-25-2",4,null,5,null,null,null,null,null,null,null,"Y",97,null,97,"Carbaryl (Sevin)","63-25-2",4,null,5,null,null,null,null,null,null,null,"Y",97,null,"","","","","","","","","","","","","","",""]
[null,98,"Carbofuran (Furadan)","1563-66-2",4,null,0.1,null,null,null,null,null,null,null,"Y",98,null,98,"Carbofuran (Furadan)","1563-66-2",4,null,0.1,null,null,null,null,null,null,null,"Y",98,null,"","","","","","","","","","","","","","",""]
[null,99,"Carbon black","1333-86-4",3,null,3,null,null,null,null,null,null,null,"Y",99,null,99,"Carbon black","1333-86-4",3,null,3,null,null,null,null,null,null,null,"Y",99,null,"","","","","","","","","","","","","","",""]
[null,100,"Carbon dioxide","124-38-9","1C",5000,9000,null,30000,54000,null,null,null,null,"Y",100,null,100,"Carbon dioxide","124-38-9","1C",5000,9000,null,30000,54000,null,null,null,null,"Y",100,null,"","","","","","","","","","","","","","",""]
[null,101,"Carbon dioxide in coal mines","124-38-9","1C",12500,22500,null,30000,54000,null,null,null,null,"Y",101,null,101,"Carbon dioxide in coal mines","124-38-9","1C",12500,22500,null,30000,54000,null,null,null,null,"Y",101,null,"","","","","","","","","","","","","","",""]
[null,102,"Carbon disulphide","75-15-0",4,10,31,null,null,null,null,null,null,null,"Y",102,null,102,"Carbon disulphide","75-15-0",4,10,31,null,null,null,null,null,null,null,"Y",102,null,"","","","","","","","","","","","","","",""]
[null,103,"Carbon monoxide ","630-08-0",4,30,34,null,null,null,null,null,null,null,"Y",103,null,103,"Carbon monoxide ","630-08-0",4,30,34,null,null,null,null,null,null,null,"Y",103,null,"","","","","","","","","","","","","","",""]
[null,104,"Carbon tetrabromide (Tetrabromomethane)","558-13-4",4,0.1,1.4,null,0.3,4.0999999999999996,null,null,null,null,"Y",104,null,104,"Carbon tetrabromide (Tetrabromomethane)","558-13-4",4,0.1,1.4,null,0.3,4.0999999999999996,null,null,null,null,"Y",104,null,"","","","","","","","","","","","","","",""]
[null,105,"Carbon tetrachloride (Tetrachloromethane)","56-23-5",4,0.1,0.63,null,null,null,null,null,null,null,"Y",105,null,105,"Carbon tetrachloride (Tetrachloromethane)","56-23-5",4,0.1,0.63,null,null,null,null,null,null,null,"Y",105,null,"","","","","","","","","","","","","","",""]
[null,106,"Carbonyl fluoride","353-50-4",4,2,5.4,null,5,13,null,null,null,null,"Y",106,null,106,"Carbonyl fluoride","353-50-4",4,2,5.4,null,5,13,null,null,null,null,"Y",106,null,"","","","","","","","","","","","","","",""]
[null,107,"Catechol (Pyrocatechol, o-Dihydroxybenzene)","120-80-9",4,5,23,null,null,null,null,null,null,null,"Y",107,null,107,"Catechol (Pyrocatechol, o-Dihydroxybenzene)","120-80-9",4,5,23,null,null,null,null,null,null,null,"Y",107,null,"","","","","","","","","","","","","","",""]
[null,108,"Cellulose (paper fibre) ","9004-34-6","1C",null,10,null,null,null,null,null,null,null,"Y",108,null,108,"Cellulose (paper fibre) ","9004-34-6","1C",null,10,null,null,null,null,null,null,null,"Y",108,null,"","","","","","","","","","","","","","",""]
[null,109,"Chlordane","57-74-9",4,null,0.5,null,null,null,null,null,null,null,"Y",109,null,109,"Chlordane","57-74-9",4,null,0.5,null,null,null,null,null,null,null,"Y",109,null,"","","","","","","","","","","","","","",""]
[null,110,"Chlorinated camphene (Camphechlor)","8001-35-2",4,null,0.5,null,null,1,null,null,null,null,"Y",110,null,110,"Chlorinated camphene (Camphechlor)","8001-35-2",4,null,0.5,null,null,1,null,null,null,null,"Y",110,null,"","","","","","","","","","","","","","",""]
[null,111,"Chlorinated diphenyl oxide","31242-93-0",3,null,0.5,null,null,null,null,null,null,null,"Y",111,null,111,"Chlorinated diphenyl oxide","31242-93-0",3,null,0.5,null,null,null,null,null,null,null,"Y",111,null,"","","","","","","","","","","","","","",""]
[null,112,"Chlorine","7782-50-5","1B",null,null,null,null,null,null,1,3,null,"N",112,null,112,"Chlorine","7782-50-5","1B",null,null,null,null,null,null,1,3,null,"N",112,null,"","","","","","","","","","","","","","",""]
[null,113,"Chlorine dioxide","10049-04-4",2,0.1,0.28000000000000003,null,0.3,0.83,null,null,null,null,"Y",113,null,113,"Chlorine dioxide","10049-04-4",2,0.1,0.28000000000000003,null,0.3,0.83,null,null,null,null,"Y",113,null,"","","","","","","","","","","","","","",""]
[null,114,"Chlorine trifluoride","7790-91-2","1A",null,null,null,null,null,null,0.1,0.38,null,"N",114,null,114,"Chlorine trifluoride","7790-91-2","1A",null,null,null,null,null,null,0.1,0.38,null,"N",114,null,"","","","","","","","","","","","","","",""]
[null,115,"1-Chloro-1-nitropropane","600-25-9",2,2,10,null,null,null,null,null,null,null,"Y",115,null,115,"1-Chloro-1-nitropropane","600-25-9",2,2,10,null,null,null,null,null,null,null,"Y",115,null,"","","","","","","","","","","","","","",""]
[null,116,"Chloroacetaldehyde","107-20-0","1A",null,null,null,null,null,null,1,3.2,null,"N",116,null,116,"Chloroacetaldehyde","107-20-0","1A",null,null,null,null,null,null,1,3.2,null,"N",116,null,"","","","","","","","","","","","","","",""]
[null,117,"Chloroacetone","78-95-5","1A",null,null,null,null,null,null,1,3.8,null,"N",117,null,117,"Chloroacetone","78-95-5","1A",null,null,null,null,null,null,1,3.8,null,"N",117,null,"","","","","","","","","","","","","","",""]
[null,118,"alpha-Chloroacetophenone (Phenacyl chloride)","532-27-4","1B",0.05,0.32,null,null,null,null,null,null,null,"Y",118,null,118,"alpha-Chloroacetophenone (Phenacyl chloride)","532-27-4","1B",0.05,0.32,null,null,null,null,null,null,null,"Y",118,null,"","","","","","","","","","","","","","",""]
[null,119,"Chloroacetyl chloride (Chloroacetic acid chloride)","79-04-9","1B",0.05,0.23,null,0.15,0.69,null,null,null,null,"Y",119,null,119,"Chloroacetyl chloride (Chloroacetic acid chloride)","79-04-9","1B",0.05,0.23,null,0.15,0.69,null,null,null,null,"Y",119,null,"","","","","","","","","","","","","","",""]
[null,120,"Chlorobenzene","108-90-7",4,10,46,null,null,null,null,null,null,null,"Y",120,null,120,"Chlorobenzene","108-90-7",4,10,46,null,null,null,null,null,null,null,"Y",120,null,"","","","","","","","","","","","","","",""]
[null,121,"o-Chlorobenzylidene malononitrile","2698-41-1","1A",null,null,null,null,null,null,0.05,0.39,null,"N",121,null,121,"o-Chlorobenzylidene malononitrile","2698-41-1","1A",null,null,null,null,null,null,0.05,0.39,null,"N",121,null,"","","","","","","","","","","","","","",""]
[null,122,"Chlorobromomethane (Bromochloromethane)","74-97-5",3,200,1060,null,null,null,null,null,null,null,"Y",122,null,122,"Chlorobromomethane (Bromochloromethane)","74-97-5",3,200,1060,null,null,null,null,null,null,null,"Y",122,null,"","","","","","","","","","","","","","",""]
[null,123,"Chlorodifluoromethane (Difluorochloromethane, Fluorocarbon 22, Freon 22)","75-45-6","1C",1000,3540,null,null,null,null,null,null,null,"Y",123,null,123,"Chlorodifluoromethane (Difluorochloromethane, Fluorocarbon 22, Freon 22)","75-45-6","1C",1000,3540,null,null,null,null,null,null,null,"Y",123,null,"","","","","","","","","","","","","","",""]
[null,124,"Chloroform (Trichloromethane)","67-66-3",4,2,10,null,null,null,null,null,null,null,"Y",124,null,124,"Chloroform (Trichloromethane)","67-66-3",4,2,10,null,null,null,null,null,null,null,"Y",124,null,"","","","","","","","","","","","","","",""]
[null,125,"bis(Chloromethyl) ether","542-88-1",3,1E-3,5.0000000000000001E-3,null,null,null,null,null,null,null,"Y",125,null,125,"bis(Chloromethyl) ether","542-88-1",3,1E-3,5.0000000000000001E-3,null,null,null,null,null,null,null,"Y",125,null,"","","","","","","","","","","","","","",""]
[null,126,"Chloropentafluoroethane (Fluorocarbon 115, Freon 115)","76-15-3","1C",1000,6320,null,null,null,null,null,null,null,"Y",126,null,126,"Chloropentafluoroethane (Fluorocarbon 115, Freon 115)","76-15-3","1C",1000,6320,null,null,null,null,null,null,null,"Y",126,null,"","","","","","","","","","","","","","",""]
[null,127,"Chloropicrin (Trichloronitromethane)","76-06-2",2,0.1,0.67,null,null,null,null,null,null,null,"Y",127,null,127,"Chloropicrin (Trichloronitromethane)","76-06-2",2,0.1,0.67,null,null,null,null,null,null,null,"Y",127,null,"","","","","","","","","","","","","","",""]
[null,128,"beta-Chloroprene (2-Chloro-1,3-butadiene)","126-99-8",4,10,36,null,null,null,null,null,null,null,"Y",128,null,128,"beta-Chloroprene (2-Chloro-1,3-butadiene)","126-99-8",4,10,36,null,null,null,null,null,null,null,"Y",128,null,"","","","","","","","","","","","","","",""]
[null,129,"2-Chloropropionic acid","598-78-7",3,0.1,0.44,null,null,null,null,null,null,null,{"$f":"IF(COUNTA(F134:H134)=0,\"N\",\"Y\")","v":"Y"},{"$f":"B134","v":129},null,129,"2-Chloropropionic acid","598-78-7",3,0.1,0.44,null,null,null,null,null,null,null,{"$f":"IF(COUNTA(V134:X134)=0,\"N\",\"Y\")","v":"Y"},{"$f":"R134","v":129},null,"","","","","","","","","","","","","","",""]
[null,130,"o-Chlorostyrene","2039-87-4",4,50,283,null,75,425,null,null,null,null,"Y",130,null,130,"o-Chlorostyrene","2039-87-4",4,50,283,null,75,425,null,null,null,null,"Y",130,null,{"$f":"IF(C135=S135,\"\",1)","v":""},{"$f":"IF(D135=T135,\"\",1)","v":""},{"$f":"IF(E135=U135,\"\",1)","v":""},{"$f":"IF(F135=V135,\"\",1)","v":""},{"$f":"IF(G135=W135,\"\",1)","v":""},{"$f":"IF(H135=X135,\"\",1)","v":""},{"$f":"IF(I135=Y135,\"\",1)","v":""},{"$f":"IF(J135=Z135,\"\",1)","v":""},{"$f":"IF(K135=AA135,\"\",1)","v":""},{"$f":"IF(L135=AB135,\"\",1)","v":""},{"$f":"IF(M135=AC135,\"\",1)","v":""},{"$f":"IF(N135=AD135,\"\",1)","v":""},{"$f":"IF(O135=AE135,\"\",1)","v":""},{"$f":"IF(P135=AF135,\"\",1)","v":""},{"$f":"IF(Q135=AG135,\"\",1)","v":""}]
[null,131,"Chlorosulphonic acid","7790-94-5",2,0.20899999999999999,1,null,null,null,null,null,null,null,"Y",131,null,131,"Chlorosulphonic acid","7790-94-5",2,0.20899999999999999,1,null,null,null,null,null,null,null,"Y",131,null,"","","","","","","","","","","","","","",""]
[null,132,"o-Chlorotoluene","95-49-8","1B",50,259,null,null,null,null,null,null,null,"Y",132,null,132,"o-Chlorotoluene","95-49-8","1B",50,259,null,null,null,null,null,null,null,"Y",132,null,"","","","","","","","","","","","","","",""]
[null,133,"Chlorpyrifos (Dursban)","2921-88-2",4,null,0.2,null,null,null,null,null,null,null,"Y",133,null,133,"Chlorpyrifos (Dursban)","2921-88-2",4,null,0.2,null,null,null,null,null,null,null,"Y",133,null,"","","","","","","","","","","","","","",""]
[null,134,"Chromium (II) compounds (as Cr)",null,3,null,0.5,null,null,null,null,null,null,null,"Y",134,null,134,"Chromium (II) compounds (as Cr)",null,3,null,0.5,null,null,null,null,null,null,null,"Y",134,null,"","","","","","","","","","","","","","",""]
[null,135,"Chromium (III) compounds (as Cr)",null,3,null,0.5,null,null,null,null,null,null,null,"Y",135,null,135,"Chromium (III) compounds (as Cr)",null,3,null,0.5,null,null,null,null,null,null,null,"Y",135,null,"","","","","","","","","","","","","","",""]
[null,136,"Chromium (metal)","7440-47-3",3,null,0.5,null,null,null,null,null,null,null,"Y",136,null,136,"Chromium (metal)","7440-47-3",3,null,0.5,null,null,null,null,null,null,null,"Y",136,null,"","","","","","","","","","","","","","",""]
[null,137,"Chromium (VI) compounds (as Cr), certain water insoluble ",null,3,null,0.05,null,null,null,null,null,null,null,"Y",137,null,137,"Chromium (VI) compounds (as Cr), certain water insoluble ",null,3,null,0.05,null,null,null,null,null,null,null,"Y",137,null,"","","","","","","","","","","","","","",""]
[null,138,"Chromium (VI) compounds (as Cr), water soluble",null,3,null,0.05,null,null,null,null,null,null,null,"Y",138,null,138,"Chromium (VI) compounds (as Cr), water soluble",null,3,null,0.05,null,null,null,null,null,null,null,"Y",138,null,"","","","","","","","","","","","","","",""]
[null,139,"Clopidol (Coyden)","2971-90-6","1C",null,10,null,null,null,null,null,null,null,"Y",139,null,139,"Clopidol (Coyden)","2971-90-6","1C",null,10,null,null,null,null,null,null,null,"Y",139,null,"","","","","","","","","","","","","","",""]
[null,140,"Coal dust (containing < 5% quartz) (respirable dust)",null,3,null,3,null,null,null,null,null,null,null,"Y",140,null,140,"Coal dust (containing < 5% quartz) (respirable dust)",null,3,null,3,null,null,null,null,null,null,null,"Y",140,null,"","","","","","","","","","","","","","",""]
[null,141,"Coal tar pitch volatiles (as benzene solubles)","65996-93-2",3,null,0.2,null,null,null,null,null,null,null,"Y",141,null,141,"Coal tar pitch volatiles (as benzene solubles)","65996-93-2",3,null,0.2,null,null,null,null,null,null,null,"Y",141,null,"","","","","","","","","","","","","","",""]
[null,142,"Cobalt carbonyl (as Co)","10210-68-1",2,null,0.1,null,null,null,null,null,null,null,"Y",142,null,142,"Cobalt carbonyl (as Co)","10210-68-1",2,null,0.1,null,null,null,null,null,null,null,"Y",142,null,"","","","","","","","","","","","","","",""]
[null,143,"Cobalt hydrocarbonyl (as Co)","16842-03-8",2,null,0.1,null,null,null,null,null,null,null,"Y",143,null,143,"Cobalt hydrocarbonyl (as Co)","16842-03-8",2,null,0.1,null,null,null,null,null,null,null,"Y",143,null,"","","","","","","","","","","","","","",""]
[null,144,"Cobalt, metal dust & fume (as Co) ","7440-48-4",3,null,0.05,null,null,null,null,null,null,null,"Y",144,null,144,"Cobalt, metal dust & fume (as Co) ","7440-48-4",3,null,0.05,null,null,null,null,null,null,null,"Y",144,null,"","","","","","","","","","","","","","",""]
[null,145,"Copper (fume)","7440-50-8",2,null,0.2,null,null,null,null,null,null,null,"Y",145,null,145,"Copper (fume)","7440-50-8",2,null,0.2,null,null,null,null,null,null,null,"Y",145,null,"","","","","","","","","","","","","","",""]
[null,146,"Copper, dusts & mists (as Cu)","7440-50-8",2,null,1,null,null,null,null,null,null,null,"Y",146,null,146,"Copper, dusts & mists (as Cu)","7440-50-8",2,null,1,null,null,null,null,null,null,null,"Y",146,null,"","","","","","","","","","","","","","",""]
[null,147,"Cotton dust, raw ",null,3,null,0.2,null,null,null,null,null,null,null,"Y",147,null,147,"Cotton dust, raw ",null,3,null,0.2,null,null,null,null,null,null,null,"Y",147,null,"","","","","","","","","","","","","","",""]
[null,148,"Cresol, all isomers","1319-77-3","1B",5,22,null,null,null,null,null,null,null,"Y",148,null,148,"Cresol, all isomers","1319-77-3","1B",5,22,null,null,null,null,null,null,null,"Y",148,null,"","","","","","","","","","","","","","",""]
[null,149,"Cristobalite (respirable dust)","14464-46-1",3,null,0.1,null,null,null,null,null,null,null,"Y",149,null,149,"Cristobalite (respirable dust)","14464-46-1",3,null,0.1,null,null,null,null,null,null,null,"Y",149,null,"","","","","","","","","","","","","","",""]
[null,150,"Crotonaldehyde (trans-But-2-enal)","4170-30-3","1B",2,5.7,null,null,null,null,null,null,null,"Y",150,null,150,"Crotonaldehyde (trans-But-2-enal)","4170-30-3","1B",2,5.7,null,null,null,null,null,null,null,"Y",150,null,"","","","","","","","","","","","","","",""]
[null,151,"Crufomate","299-86-5",4,null,5,null,null,null,null,null,null,null,"Y",151,null,151,"Crufomate","299-86-5",4,null,5,null,null,null,null,null,null,null,"Y",151,null,"","","","","","","","","","","","","","",""]
[null,152,"Cumene (Isopropyl benzene)","98-82-8",2,25,125,null,75,375,null,null,null,null,"Y",152,null,152,"Cumene (Isopropyl benzene)","98-82-8",2,25,125,null,75,375,null,null,null,null,"Y",152,null,"","","","","","","","","","","","","","",""]
[null,153,"Cyanamide","420-04-2",4,null,2,null,null,null,null,null,null,null,"Y",153,null,153,"Cyanamide","420-04-2",4,null,2,null,null,null,null,null,null,null,"Y",153,null,"","","","","","","","","","","","","","",""]
[null,154,"Cyanides (as CN)","151-50-8",2,null,5,null,null,null,null,null,null,null,"Y",154,null,154,"Cyanides (as CN)","151-50-8",2,null,5,null,null,null,null,null,null,null,"Y",154,null,"","","","","","","","","","","","","","",""]
[null,155,"Cyanogen (Oxalonitrile)","460-19-5","1B",10,21,null,null,null,null,null,null,null,"Y",155,null,155,"Cyanogen (Oxalonitrile)","460-19-5","1B",10,21,null,null,null,null,null,null,null,"Y",155,null,"","","","","","","","","","","","","","",""]
[null,156,"Cyanogen chloride","506-77-4","1A",null,null,null,null,null,null,0.3,0.75,null,"N",156,null,156,"Cyanogen chloride","506-77-4","1A",null,null,null,null,null,null,0.3,0.75,null,"N",156,null,"","","","","","","","","","","","","","",""]
[null,157,"Cyclohexane","110-82-7",2,100,350,null,300,1050,null,null,null,null,"Y",157,null,157,"Cyclohexane","110-82-7",2,100,350,null,300,1050,null,null,null,null,"Y",157,null,"","","","","","","","","","","","","","",""]
[null,158,"Cyclohexanol","108-93-0",4,50,206,null,null,null,null,null,null,null,"Y",158,null,158,"Cyclohexanol","108-93-0",4,50,206,null,null,null,null,null,null,null,"Y",158,null,"","","","","","","","","","","","","","",""]
[null,159,"Cyclohexanone (Anone)","108-94-1",3,25,100,null,null,null,null,null,null,null,"Y",159,null,159,"Cyclohexanone (Anone)","108-94-1",3,25,100,null,null,null,null,null,null,null,"Y",159,null,"","","","","","","","","","","","","","",""]
[null,160,"Cyclohexene","110-83-8","1B",300,1010,null,null,null,null,null,null,null,"Y",160,null,160,"Cyclohexene","110-83-8","1B",300,1010,null,null,null,null,null,null,null,"Y",160,null,"","","","","","","","","","","","","","",""]
[null,161,"Cyclohexylamine (Aminocyclohexane)","108-91-8","1B",10,41,null,null,null,null,null,null,null,"Y",161,null,161,"Cyclohexylamine (Aminocyclohexane)","108-91-8","1B",10,41,null,null,null,null,null,null,null,"Y",161,null,"","","","","","","","","","","","","","",""]
[null,162,"Cyclonite (Hexahydro-1,3,5-trinitro-1,3,5-triazine, RDX)","121-82-4",3,null,1.5,null,null,null,null,null,null,null,"Y",162,null,162,"Cyclonite (Hexahydro-1,3,5-trinitro-1,3,5-triazine, RDX)","121-82-4",3,null,1.5,null,null,null,null,null,null,null,"Y",162,null,"","","","","","","","","","","","","","",""]
[null,163,"Cyclopentadiene","542-92-7","1B",75,203,null,null,null,null,null,null,null,"Y",163,null,163,"Cyclopentadiene","542-92-7","1B",75,203,null,null,null,null,null,null,null,"Y",163,null,"","","","","","","","","","","","","","",""]
[null,164,"Cyclopentane","287-92-3",4,600,1720,null,null,null,null,null,null,null,"Y",164,null,164,"Cyclopentane","287-92-3",4,600,1720,null,null,null,null,null,null,null,"Y",164,null,"","","","","","","","","","","","","","",""]
[null,165,"Cyhexatin (Tricyclohexyltin hydroxide, Plictran)","13121-70-5","1C",null,5,null,null,null,null,null,null,null,"Y",165,null,165,"Cyhexatin (Tricyclohexyltin hydroxide, Plictran)","13121-70-5","1C",null,5,null,null,null,null,null,null,null,"Y",165,null,"","","","","","","","","","","","","","",""]
[null,166,"2,4-D (2,4-Dichlorophenoxyacetic acid)","94-75-7",3,null,10,null,null,null,null,null,null,null,"Y",166,null,166,"2,4-D (2,4-Dichlorophenoxyacetic acid)","94-75-7",3,null,10,null,null,null,null,null,null,null,"Y",166,null,"","","","","","","","","","","","","","",""]
[null,167,"DDT (Dichlorodiphenyl-trichloroethane)","50-29-3",4,null,1,null,null,null,null,null,null,null,"Y",167,null,167,"DDT (Dichlorodiphenyl-trichloroethane)","50-29-3",4,null,1,null,null,null,null,null,null,null,"Y",167,null,"","","","","","","","","","","","","","",""]
[null,168,"Decaborane","17702-41-9",4,0.05,0.25,null,0.15,0.75,null,null,null,null,"Y",168,null,168,"Decaborane","17702-41-9",4,0.05,0.25,null,0.15,0.75,null,null,null,null,"Y",168,null,"","","","","","","","","","","","","","",""]
[null,169,"Demeton (Systox)","8065-48-3",4,0.01,0.11,null,null,null,null,null,null,null,"Y",169,null,169,"Demeton (Systox)","8065-48-3",4,0.01,0.11,null,null,null,null,null,null,null,"Y",169,null,"","","","","","","","","","","","","","",""]
[null,170,"Diacetone alcohol (4-Hydroxy-4-methyl-2-pentanone)","123-42-2","1B",50,238,null,null,null,null,null,null,null,"Y",170,null,170,"Diacetone alcohol (4-Hydroxy-4-methyl-2-pentanone)","123-42-2","1B",50,238,null,null,null,null,null,null,null,"Y",170,null,"","","","","","","","","","","","","","",""]
[null,171,"Diatomaceous earth (uncalcined) ","61790-53-2","1C",null,10,null,null,null,null,null,null,null,"Y",171,null,171,"Diatomaceous earth (uncalcined) ","61790-53-2","1C",null,10,null,null,null,null,null,null,null,"Y",171,null,"","","","","","","","","","","","","","",""]
[null,172,"Diazinon","333-41-5",4,null,0.1,null,null,null,null,null,null,null,"Y",172,null,172,"Diazinon","333-41-5",4,null,0.1,null,null,null,null,null,null,null,"Y",172,null,"","","","","","","","","","","","","","",""]
[null,173,"Diazomethane","334-88-3",4,0.2,0.34,null,null,null,null,null,null,null,"Y",173,null,173,"Diazomethane","334-88-3",4,0.2,0.34,null,null,null,null,null,null,null,"Y",173,null,"","","","","","","","","","","","","","",""]
[null,174,"Diborane","19287-45-7",4,0.1,0.11,null,null,null,null,null,null,null,"Y",174,null,174,"Diborane","19287-45-7",4,0.1,0.11,null,null,null,null,null,null,null,"Y",174,null,"","","","","","","","","","","","","","",""]
[null,175,"Dibutyl phenyl phosphate","2528-36-1",4,0.3,3.5,null,null,null,null,null,null,null,"Y",175,null,175,"Dibutyl phenyl phosphate","2528-36-1",4,0.3,3.5,null,null,null,null,null,null,null,"Y",175,null,"","","","","","","","","","","","","","",""]
[null,176,"Dibutyl phosphate (Dibutyl hydrogen phosphate)","107-66-4","1B",1,8.6,null,2,17,null,null,null,null,"Y",176,null,176,"Dibutyl phosphate (Dibutyl hydrogen phosphate)","107-66-4","1B",1,8.6,null,2,17,null,null,null,null,"Y",176,null,"","","","","","","","","","","","","","",""]
[null,177,"Dibutyl phthalate","84-74-2",4,null,5,null,null,null,null,null,null,null,"Y",177,null,177,"Dibutyl phthalate","84-74-2",4,null,5,null,null,null,null,null,null,null,"Y",177,null,"","","","","","","","","","","","","","",""]
[null,178,"2-N-Dibutylaminoethanol (N,N-Di-n-butylaminoethanol)","102-81-8",3,2,14,null,null,null,null,null,null,null,"Y",178,null,178,"2-N-Dibutylaminoethanol (N,N-Di-n-butylaminoethanol)","102-81-8",3,2,14,null,null,null,null,null,null,null,"Y",178,null,"","","","","","","","","","","","","","",""]
[null,179,"1,1-Dichloro-1-nitroethane","594-72-9",2,2,12,null,null,null,null,null,null,null,"Y",179,null,179,"1,1-Dichloro-1-nitroethane","594-72-9",2,2,12,null,null,null,null,null,null,null,"Y",179,null,"","","","","","","","","","","","","","",""]
[null,180,"1,3-Dichloro-5,5-dimethyl hydantoin","118-52-5","1B",null,0.2,null,null,0.4,null,null,null,null,"Y",180,null,180,"1,3-Dichloro-5,5-dimethyl hydantoin","118-52-5","1B",null,0.2,null,null,0.4,null,null,null,null,"Y",180,null,"","","","","","","","","","","","","","",""]
[null,181,"Dichloroacetylene","7572-29-4","1A",null,null,null,null,null,null,0.1,0.39,null,"N",181,null,181,"Dichloroacetylene","7572-29-4","1A",null,null,null,null,null,null,0.1,0.39,null,"N",181,null,"","","","","","","","","","","","","","",""]
[null,182,"o-Dichlorobenzene","95-50-1","1B",25,150,null,50,301,null,null,null,null,"Y",182,null,182,"o-Dichlorobenzene","95-50-1","1B",25,150,null,50,301,null,null,null,null,"Y",182,null,"","","","","","","","","","","","","","",""]
[null,183,"p-Dichlorobenzene","106-46-7",3,25,150,null,50,300,null,null,null,null,"Y",183,null,183,"p-Dichlorobenzene","106-46-7",3,25,150,null,50,300,null,null,null,null,"Y",183,null,"","","","","","","","","","","","","","",""]
[null,184,"Dichlorodifluoromethane (Fluorocarbon 12, Freon 12)","75-71-8","1C",1000,4950,null,null,null,null,null,null,null,"Y",184,null,184,"Dichlorodifluoromethane (Fluorocarbon 12, Freon 12)","75-71-8","1C",1000,4950,null,null,null,null,null,null,null,"Y",184,null,"","","","","","","","","","","","","","",""]
[null,185,"1,1-Dichloroethane (Ethylidene chloride)","75-34-3",4,100,412,null,null,null,null,null,null,null,"Y",185,null,185,"1,1-Dichloroethane (Ethylidene chloride)","75-34-3",4,100,412,null,null,null,null,null,null,null,"Y",185,null,"","","","","","","","","","","","","","",""]
[null,186,"Dichloroethyl ether (bis-(2-Chloroethyl)-ether)","111-44-4",2,5,29,null,10,58,null,null,null,null,"Y",186,null,186,"Dichloroethyl ether (bis-(2-Chloroethyl)-ether)","111-44-4",2,5,29,null,10,58,null,null,null,null,"Y",186,null,"","","","","","","","","","","","","","",""]
[null,187,"1,2-Dichloroethylene (Acetylene dichloride)","540-59-0",4,200,793,null,null,null,null,null,null,null,"Y",187,null,187,"1,2-Dichloroethylene (Acetylene dichloride)","540-59-0",4,200,793,null,null,null,null,null,null,null,"Y",187,null,"","","","","","","","","","","","","","",""]
[null,188,"Dichlorofluoromethane (Fluorocarbon 21, Freon 21)","75-43-4",3,10,42,null,null,null,null,null,null,null,"Y",188,null,188,"Dichlorofluoromethane (Fluorocarbon 21, Freon 21)","75-43-4",3,10,42,null,null,null,null,null,null,null,"Y",188,null,"","","","","","","","","","","","","","",""]
[null,189,"Dichloropropene (gamma-Chloroallyl chloride)","542-75-6",4,1,4.5,null,null,null,null,null,null,null,"Y",189,null,189,"Dichloropropene (gamma-Chloroallyl chloride)","542-75-6",4,1,4.5,null,null,null,null,null,null,null,"Y",189,null,"","","","","","","","","","","","","","",""]
[null,190,"2,2-Dichloropropionic acid (Dalapon)","75-99-0","1B",1,5.8,null,null,null,null,null,null,null,"Y",190,null,190,"2,2-Dichloropropionic acid (Dalapon)","75-99-0","1B",1,5.8,null,null,null,null,null,null,null,"Y",190,null,"","","","","","","","","","","","","","",""]
[null,191,"Dichlorotetrafluoroethane (Fluorocarbon 114, Freon 114, R-114, Tetrafluoro dichloroethane)","76-14-2","1C",1000,6990,null,null,null,null,null,null,null,"Y",191,null,191,"Dichlorotetrafluoroethane (Fluorocarbon 114, Freon 114, R-114, Tetrafluoro dichloroethane)","76-14-2","1C",1000,6990,null,null,null,null,null,null,null,"Y",191,null,"","","","","","","","","","","","","","",""]
[null,192,"Dichlorvos (DDVP)","62-73-7",4,0.1,0.9,null,null,null,null,null,null,null,"Y",192,null,192,"Dichlorvos (DDVP)","62-73-7",4,0.1,0.9,null,null,null,null,null,null,null,"Y",192,null,"","","","","","","","","","","","","","",""]
[null,193,"Dicrotophos (Bidrin)","141-66-2",4,null,0.25,null,null,null,null,null,null,null,{"$f":"IF(COUNTA(F198:H198)=0,\"N\",\"Y\")","v":"Y"},{"$f":"B198","v":193},null,193,"Dicrotophos (Bidrin)","141-66-2",4,null,0.25,null,null,null,null,null,null,null,{"$f":"IF(COUNTA(V198:X198)=0,\"N\",\"Y\")","v":"Y"},{"$f":"R198","v":193},null,"","","","","","","","","","","","","","",""]
[null,194,"Dicyclopentadiene","77-73-6",3,5,27,null,null,null,null,null,null,null,"Y",194,null,194,"Dicyclopentadiene","77-73-6",3,5,27,null,null,null,null,null,null,null,"Y",194,null,{"$f":"IF(C199=S199,\"\",1)","v":""},{"$f":"IF(D199=T199,\"\",1)","v":""},{"$f":"IF(E199=U199,\"\",1)","v":""},{"$f":"IF(F199=V199,\"\",1)","v":""},{"$f":"IF(G199=W199,\"\",1)","v":""},{"$f":"IF(H199=X199,\"\",1)","v":""},{"$f":"IF(I199=Y199,\"\",1)","v":""},{"$f":"IF(J199=Z199,\"\",1)","v":""},{"$f":"IF(K199=AA199,\"\",1)","v":""},{"$f":"IF(L199=AB199,\"\",1)","v":""},{"$f":"IF(M199=AC199,\"\",1)","v":""},{"$f":"IF(N199=AD199,\"\",1)","v":""},{"$f":"IF(O199=AE199,\"\",1)","v":""},{"$f":"IF(P199=AF199,\"\",1)","v":""},{"$f":"IF(Q199=AG199,\"\",1)","v":""}]
[null,195,"Dicyclopentadienyl iron (Ferrocene)","102-54-5","1C",null,10,null,null,null,null,null,null,null,"Y",195,null,195,"Dicyclopentadienyl iron (Ferrocene)","102-54-5","1C",null,10,null,null,null,null,null,null,null,"Y",195,null,"","","","","","","","","","","","","","",""]
[null,196,"Dieldrin","60-57-1",4,null,0.25,null,null,null,null,null,null,null,"Y",196,null,196,"Dieldrin","60-57-1",4,null,0.25,null,null,null,null,null,null,null,"Y",196,null,"","","","","","","","","","","","","","",""]
[null,197,"Diethanolamine (2,2'-Iminodiethanol)","111-42-2",4,3,13,null,null,null,null,null,null,null,"Y",197,null,197,"Diethanolamine (2,2'-Iminodiethanol)","111-42-2",4,3,13,null,null,null,null,null,null,null,"Y",197,null,"","","","","","","","","","","","","","",""]
[null,198,"Diethyl ketone (3-Pentanone)","96-22-0",2,200,705,null,null,null,null,null,null,null,"Y",198,null,198,"Diethyl ketone (3-Pentanone)","96-22-0",2,200,705,null,null,null,null,null,null,null,"Y",198,null,"","","","","","","","","","","","","","",""]
[null,199,"Diethyl phthalate","84-66-2","1B",null,5,null,null,null,null,null,null,null,"Y",199,null,199,"Diethyl phthalate","84-66-2","1B",null,5,null,null,null,null,null,null,null,"Y",199,null,"","","","","","","","","","","","","","",""]
[null,200,"Diethylamine ","109-89-7","1B",10,30,null,25,75,null,null,null,null,"Y",200,null,200,"Diethylamine ","109-89-7","1B",10,30,null,25,75,null,null,null,null,"Y",200,null,"","","","","","","","","","","","","","",""]
[null,201,"2-Diethylaminoethanol ","100-37-8","1B",10,48,null,null,null,null,null,null,null,"Y",201,null,201,"2-Diethylaminoethanol ","100-37-8","1B",10,48,null,null,null,null,null,null,null,"Y",201,null,"","","","","","","","","","","","","","",""]
[null,202,"Diethylene triamine (2,2'-Diaminodiethylamine, 1,4,7-Tri-(aza)-heptane)","111-40-0",4,1,4.2,null,null,null,null,null,null,null,"Y",202,null,202,"Diethylene triamine (2,2'-Diaminodiethylamine, 1,4,7-Tri-(aza)-heptane)","111-40-0",4,1,4.2,null,null,null,null,null,null,null,"Y",202,null,"","","","","","","","","","","","","","",""]
[null,203,"Difluorodibromomethane (Dibromodifluoromethane)","75-61-6",4,100,858,null,null,null,null,null,null,null,"Y",203,null,203,"Difluorodibromomethane (Dibromodifluoromethane)","75-61-6",4,100,858,null,null,null,null,null,null,null,"Y",203,null,"","","","","","","","","","","","","","",""]
[null,204,"Diglycidyl ether (DGE, bis(2,3-Epoxy propyl) ether)","2238-07-5",3,0.1,0.53,null,null,null,null,null,null,null,"Y",204,null,204,"Diglycidyl ether (DGE, bis(2,3-Epoxy propyl) ether)","2238-07-5",3,0.1,0.53,null,null,null,null,null,null,null,"Y",204,null,"","","","","","","","","","","","","","",""]
[null,205,"Diisobutyl ketone (2,6-Dimethyl-4-heptanone)","108-83-8","1B",25,145,null,null,null,null,null,null,null,"Y",205,null,205,"Diisobutyl ketone (2,6-Dimethyl-4-heptanone)","108-83-8","1B",25,145,null,null,null,null,null,null,null,"Y",205,null,"","","","","","","","","","","","","","",""]
[null,206,"Diisopropylamine","108-18-9","1B",5,21,null,null,null,null,null,null,null,"Y",206,null,206,"Diisopropylamine","108-18-9","1B",5,21,null,null,null,null,null,null,null,"Y",206,null,"","","","","","","","","","","","","","",""]
[null,207,"Dimethyl acetamide","127-19-5",4,10,36,null,null,null,null,null,null,null,"Y",207,null,207,"Dimethyl acetamide","127-19-5",4,10,36,null,null,null,null,null,null,null,"Y",207,null,"","","","","","","","","","","","","","",""]
[null,208,"Dimethyl ether","115-10-6","1B",400,760,null,500,950,null,null,null,null,"Y",208,null,208,"Dimethyl ether","115-10-6","1B",400,760,null,500,950,null,null,null,null,"Y",208,null,"","","","","","","","","","","","","","",""]
[null,209,"Dimethyl sulphate","77-78-1",4,0.1,0.52,null,null,null,null,null,null,null,"Y",209,null,209,"Dimethyl sulphate","77-78-1",4,0.1,0.52,null,null,null,null,null,null,null,"Y",209,null,"","","","","","","","","","","","","","",""]
[null,210,"Dimethylamine","124-40-3","1B",2,3.8,null,6,11,null,null,null,null,"Y",210,null,210,"Dimethylamine","124-40-3","1B",2,3.8,null,6,11,null,null,null,null,"Y",210,null,"","","","","","","","","","","","","","",""]
[null,211,"Dimethylaminoethanol","108-01-0","1B",2,7.4,null,6,22,null,null,null,null,"Y",211,null,211,"Dimethylaminoethanol","108-01-0","1B",2,7.4,null,6,22,null,null,null,null,"Y",211,null,"","","","","","","","","","","","","","",""]
[null,212,"N,N-Dimethylaniline","121-69-7",4,5,25,null,10,50,null,null,null,null,"Y",212,null,212,"N,N-Dimethylaniline","121-69-7",4,5,25,null,10,50,null,null,null,null,"Y",212,null,"","","","","","","","","","","","","","",""]
[null,213,"N,N-Dimethylethylamine (N,N-Dimethylethanamine)","598-56-1",4,10,30,null,15,45,null,null,null,null,"Y",213,null,213,"N,N-Dimethylethylamine (N,N-Dimethylethanamine)","598-56-1",4,10,30,null,15,45,null,null,null,null,"Y",213,null,"","","","","","","","","","","","","","",""]
[null,214,"Dimethylformamide","68-12-2",3,10,30,null,null,null,null,null,null,null,"Y",214,null,214,"Dimethylformamide","68-12-2",3,10,30,null,null,null,null,null,null,null,"Y",214,null,"","","","","","","","","","","","","","",""]
[null,215,"1,1-Dimethylhydrazine","57-14-7",3,0.01,2.5000000000000001E-2,null,null,null,null,null,null,null,"Y",215,null,215,"1,1-Dimethylhydrazine","57-14-7",3,0.01,2.5000000000000001E-2,null,null,null,null,null,null,null,"Y",215,null,"","","","","","","","","","","","","","",""]
[null,216,"Dimethylphthalate","131-11-3","1B",null,5,null,null,null,null,null,null,null,"Y",216,null,216,"Dimethylphthalate","131-11-3","1B",null,5,null,null,null,null,null,null,null,"Y",216,null,"","","","","","","","","","","","","","",""]
[null,217,"Dinitolmide (3,5-Dinitro-o-toluamide, Zoalene)","148-01-6",3,null,5,null,null,null,null,null,null,null,"Y",217,null,217,"Dinitolmide (3,5-Dinitro-o-toluamide, Zoalene)","148-01-6",3,null,5,null,null,null,null,null,null,null,"Y",217,null,"","","","","","","","","","","","","","",""]
[null,218,"m-Dinitrobenzene","99-65-0",4,0.15,1,null,null,null,null,null,null,null,"Y",218,null,218,"m-Dinitrobenzene","99-65-0",4,0.15,1,null,null,null,null,null,null,null,"Y",218,null,"","","","","","","","","","","","","","",""]
[null,219,"o-Dinitrobenzene","528-29-0",4,0.15,1,null,null,null,null,null,null,null,"Y",219,null,219,"o-Dinitrobenzene","528-29-0",4,0.15,1,null,null,null,null,null,null,null,"Y",219,null,"","","","","","","","","","","","","","",""]
[null,220,"p-Dinitrobenzene","100-25-4",4,0.15,1,null,null,null,null,null,null,null,"Y",220,null,220,"p-Dinitrobenzene","100-25-4",4,0.15,1,null,null,null,null,null,null,null,"Y",220,null,"","","","","","","","","","","","","","",""]
[null,221,"Dinitro-o-cresol (DNOC, 2-Methyl-4,6-dinitrophenol)","534-52-1",3,null,0.2,null,null,null,null,null,null,null,"Y",221,null,221,"Dinitro-o-cresol (DNOC, 2-Methyl-4,6-dinitrophenol)","534-52-1",3,null,0.2,null,null,null,null,null,null,null,"Y",221,null,"","","","","","","","","","","","","","",""]
[null,222,"Dinitrotoluene ","25321-14-6",4,null,1.5,null,null,null,null,null,null,null,"Y",222,null,222,"Dinitrotoluene ","25321-14-6",4,null,1.5,null,null,null,null,null,null,null,"Y",222,null,"","","","","","","","","","","","","","",""]
[null,223,"1,4-Dioxane (Diethylene dioxide)","123-91-1",3,10,36,null,null,null,null,null,null,null,"Y",223,null,223,"1,4-Dioxane (Diethylene dioxide)","123-91-1",3,10,36,null,null,null,null,null,null,null,"Y",223,null,"","","","","","","","","","","","","","",""]
[null,224,"Dioxathion (Delnav)","78-34-2",4,null,0.2,null,null,null,null,null,null,null,"Y",224,null,224,"Dioxathion (Delnav)","78-34-2",4,null,0.2,null,null,null,null,null,null,null,"Y",224,null,"","","","","","","","","","","","","","",""]
[null,225,"Diphenylamine","122-39-4",4,null,10,null,null,null,null,null,null,null,"Y",225,null,225,"Diphenylamine","122-39-4",4,null,10,null,null,null,null,null,null,null,"Y",225,null,"","","","","","","","","","","","","","",""]
[null,226,"Dipropyl ketone (4-Heptanone)","123-19-3","1B",50,233,null,null,null,null,null,null,null,"Y",226,null,226,"Dipropyl ketone (4-Heptanone)","123-19-3","1B",50,233,null,null,null,null,null,null,null,"Y",226,null,"","","","","","","","","","","","","","",""]
[null,227,"Diquat (Diquat dibromide (ISO))","85-00-7",3,null,0.5,null,null,null,null,null,null,null,"Y",227,null,227,"Diquat (Diquat dibromide (ISO))","85-00-7",3,null,0.5,null,null,null,null,null,null,null,"Y",227,null,"","","","","","","","","","","","","","",""]
[null,228,"Di-sec-octyl phthalate (DOP, Di (2-ethylhexyl) phthalate, bis(2-Ethylhexyl) phthalate)","117-81-7",3,null,5,null,null,10,null,null,null,null,"Y",228,null,228,"Di-sec-octyl phthalate (DOP, Di (2-ethylhexyl) phthalate, bis(2-Ethylhexyl) phthalate)","117-81-7",3,null,5,null,null,10,null,null,null,null,"Y",228,null,"","","","","","","","","","","","","","",""]
[null,229,"Disulfiram (Tetraethyl thiuram disulphide)","97-77-8",2,null,2,null,null,null,null,null,null,null,"Y",229,null,229,"Disulfiram (Tetraethyl thiuram disulphide)","97-77-8",2,null,2,null,null,null,null,null,null,null,"Y",229,null,"","","","","","","","","","","","","","",""]
[null,230,"Disulfoton (Disyston)","298-04-4",4,null,0.1,null,null,null,null,null,null,null,"Y",230,null,230,"Disulfoton (Disyston)","298-04-4",4,null,0.1,null,null,null,null,null,null,null,"Y",230,null,"","","","","","","","","","","","","","",""]
[null,231,"2,6-Di-tert-butyl-p-cresol","128-37-0","1C",null,10,null,null,null,null,null,null,null,"Y",231,null,231,"2,6-Di-tert-butyl-p-cresol","128-37-0","1C",null,10,null,null,null,null,null,null,null,"Y",231,null,"","","","","","","","","","","","","","",""]
[null,232,"Diuron","330-54-1","1C",null,10,null,null,null,null,null,null,null,"Y",232,null,232,"Diuron","330-54-1","1C",null,10,null,null,null,null,null,null,null,"Y",232,null,"","","","","","","","","","","","","","",""]
[null,233,"Divinyl benzene","1321-74-0","1B",10,53,null,null,null,null,null,null,null,"Y",233,null,233,"Divinyl benzene","1321-74-0","1B",10,53,null,null,null,null,null,null,null,"Y",233,null,"","","","","","","","","","","","","","",""]
[null,234,"Emery (dust) ","1302-74-5","1C",null,10,null,null,null,null,null,null,null,"Y",234,null,234,"Emery (dust) ","1302-74-5","1C",null,10,null,null,null,null,null,null,null,"Y",234,null,"","","","","","","","","","","","","","",""]
[null,235,"Endosulfan (Thiodan)","115-29-7",4,null,0.1,null,null,null,null,null,null,null,"Y",235,null,235,"Endosulfan (Thiodan)","115-29-7",4,null,0.1,null,null,null,null,null,null,null,"Y",235,null,"","","","","","","","","","","","","","",""]
[null,236,"Endrin","72-20-8",2,null,0.1,null,null,null,null,null,null,null,"Y",236,null,236,"Endrin","72-20-8",2,null,0.1,null,null,null,null,null,null,null,"Y",236,null,"","","","","","","","","","","","","","",""]
[null,237,"Enflurane (2-Chloro-1,1,2-trifluoroethyl difluoromethyl ether)","13838-16-9",2,0.5,3.8,null,null,null,null,null,null,null,"Y",237,null,237,"Enflurane (2-Chloro-1,1,2-trifluoroethyl difluoromethyl ether)","13838-16-9",2,0.5,3.8,null,null,null,null,null,null,null,"Y",237,null,"","","","","","","","","","","","","","",""]
[null,238,"Epichlorohydrin (1-Chloro-2,3-epoxy-propane)","106-89-8",4,2,7.6,null,null,null,null,null,null,null,"Y",238,null,238,"Epichlorohydrin (1-Chloro-2,3-epoxy-propane)","106-89-8",4,2,7.6,null,null,null,null,null,null,null,"Y",238,null,"","","","","","","","","","","","","","",""]
[null,239,"EPN (O-Ethyl-O-(4-nitrophenyl) phenylthiophosphonate)","2104-64-5",4,null,0.5,null,null,null,null,null,null,null,"Y",239,null,239,"EPN (O-Ethyl-O-(4-nitrophenyl) phenylthiophosphonate)","2104-64-5",4,null,0.5,null,null,null,null,null,null,null,"Y",239,null,"","","","","","","","","","","","","","",""]
[null,240,"Ethanolamine (2-Aminoethanol)","141-43-5",3,3,7.5,null,6,15,null,null,null,null,"Y",240,null,240,"Ethanolamine (2-Aminoethanol)","141-43-5",3,3,7.5,null,6,15,null,null,null,null,"Y",240,null,"","","","","","","","","","","","","","",""]
[null,241,"Ethion (Nialate)","563-12-2",4,null,0.4,null,null,null,null,null,null,null,"Y",241,null,241,"Ethion (Nialate)","563-12-2",4,null,0.4,null,null,null,null,null,null,null,"Y",241,null,"","","","","","","","","","","","","","",""]
[null,242,"2-Ethoxyethanol (Cellosolve; Ethyl glycol; Ethylene glycol, monoethyl ether; Glycol, monoethyl ether)","110-80-5",4,5,18,null,null,null,null,null,null,null,"Y",242,null,242,"2-Ethoxyethanol (Cellosolve; Ethyl glycol; Ethylene glycol, monoethyl ether; Glycol, monoethyl ether)","110-80-5",4,5,18,null,null,null,null,null,null,null,"Y",242,null,"","","","","","","","","","","","","","",""]
[null,243,"2-Ethoxyethyl acetate (Cellosolve acetate; Glycol, monoethyl ether acetate; Ethylene glycol, monoethyl ether acetate; Ethyl glycol acetate)","111-15-9",4,5,27,null,null,null,null,null,null,null,"Y",243,null,243,"2-Ethoxyethyl acetate (Cellosolve acetate; Glycol, monoethyl ether acetate; Ethylene glycol, monoethyl ether acetate; Ethyl glycol acetate)","111-15-9",4,5,27,null,null,null,null,null,null,null,"Y",243,null,"","","","","","","","","","","","","","",""]
[null,244,"Ethyl acetate (Acetic acid ethyl ester, Acetic ester)","141-78-6","1B",200,720,null,400,1440,null,null,null,null,"Y",244,null,244,"Ethyl acetate (Acetic acid ethyl ester, Acetic ester)","141-78-6","1B",200,720,null,400,1440,null,null,null,null,"Y",244,null,"","","","","","","","","","","","","","",""]
[null,245,"Ethyl acrylate (Acrylic acid,ethyl ester)","140-88-5",4,null,null,null,null,null,null,5,20,null,"N",245,null,245,"Ethyl acrylate (Acrylic acid,ethyl ester)","140-88-5",4,null,null,null,null,null,null,5,20,null,"N",245,null,"","","","","","","","","","","","","","",""]
[null,246,"Ethyl alcohol (Ethanol)","64-17-5","1B",1000,1880,null,null,null,null,null,null,null,"Y",246,null,246,"Ethyl alcohol (Ethanol)","64-17-5","1B",1000,1880,null,null,null,null,null,null,null,"Y",246,null,"","","","","","","","","","","","","","",""]
[null,247,"Ethyl benzene","100-41-4",4,100,434,null,125,543,null,null,null,null,"Y",247,null,247,"Ethyl benzene","100-41-4",4,100,434,null,125,543,null,null,null,null,"Y",247,null,"","","","","","","","","","","","","","",""]
[null,248,"Ethyl bromide (Bromoethane)","74-96-4",4,5,22,null,null,null,null,null,null,null,"Y",248,null,248,"Ethyl bromide (Bromoethane)","74-96-4",4,5,22,null,null,null,null,null,null,null,"Y",248,null,"","","","","","","","","","","","","","",""]
[null,249,"Ethyl butyl ketone (3-Heptanone)","106-35-4",2,50,234,null,null,null,null,null,null,null,"Y",249,null,249,"Ethyl butyl ketone (3-Heptanone)","106-35-4",2,50,234,null,null,null,null,null,null,null,"Y",249,null,"","","","","","","","","","","","","","",""]
[null,250,"Ethyl chloride (Chloroethane)","75-00-3",4,1000,2640,null,null,null,null,null,null,null,"Y",250,null,250,"Ethyl chloride (Chloroethane)","75-00-3",4,1000,2640,null,null,null,null,null,null,null,"Y",250,null,"","","","","","","","","","","","","","",""]
[null,251,"Ethyl ether (Diethyl ether)","60-29-7","1B",400,1210,null,500,1520,null,null,null,null,"Y",251,null,251,"Ethyl ether (Diethyl ether)","60-29-7","1B",400,1210,null,500,1520,null,null,null,null,"Y",251,null,"","","","","","","","","","","","","","",""]
[null,252,"Ethyl formate (Formic acid, ethyl ester)","109-94-4","1B",100,303,null,null,null,null,null,null,null,"Y",252,null,252,"Ethyl formate (Formic acid, ethyl ester)","109-94-4","1B",100,303,null,null,null,null,null,null,null,"Y",252,null,"","","","","","","","","","","","","","",""]
[null,253,"Ethyl mercaptan (Ethanethiol)","75-08-1","1B",0.5,1.3,null,null,null,null,null,null,null,"Y",253,null,253,"Ethyl mercaptan (Ethanethiol)","75-08-1","1B",0.5,1.3,null,null,null,null,null,null,null,"Y",253,null,"","","","","","","","","","","","","","",""]
[null,254,"Ethyl silicate (Tetraethyl orthosilicate)","78-10-4",3,10,85,null,null,null,null,null,null,null,"Y",254,null,254,"Ethyl silicate (Tetraethyl orthosilicate)","78-10-4",3,10,85,null,null,null,null,null,null,null,"Y",254,null,"","","","","","","","","","","","","","",""]
[null,255,"Ethylamine","75-04-7","1B",2,3.8,null,6,11,null,null,null,null,"Y",255,null,255,"Ethylamine","75-04-7","1B",2,3.8,null,6,11,null,null,null,null,"Y",255,null,"","","","","","","","","","","","","","",""]
[null,256,"Ethylene chlorohydrin (2-Chloroethanol)","107-07-3","1A",null,null,null,null,null,null,1,3.3,null,"N",256,null,256,"Ethylene chlorohydrin (2-Chloroethanol)","107-07-3","1A",null,null,null,null,null,null,1,3.3,null,"N",256,null,"","","","","","","","","","","","","","",""]
[null,257,"Ethylene dichloride (1,2-Dichloroethane)","107-06-2",3,10,40,null,null,null,null,null,null,null,{"$f":"IF(COUNTA(F262:H262)=0,\"N\",\"Y\")","v":"Y"},{"$f":"B262","v":257},null,257,"Ethylene dichloride (1,2-Dichloroethane)","107-06-2",3,10,40,null,null,null,null,null,null,null,{"$f":"IF(COUNTA(V262:X262)=0,\"N\",\"Y\")","v":"Y"},{"$f":"R262","v":257},null,"","","","","","","","","","","","","","",""]
[null,258,"Ethylene glycol (particulate) (Ethane-1,2-diol)","107-21-1","1B",null,10,null,null,null,null,null,null,null,"Y",258,null,258,"Ethylene glycol (particulate) (Ethane-1,2-diol)","107-21-1","1B",null,10,null,null,null,null,null,null,null,"Y",258,null,{"$f":"IF(C263=S263,\"\",1)","v":""},{"$f":"IF(D263=T263,\"\",1)","v":""},{"$f":"IF(E263=U263,\"\",1)","v":""},{"$f":"IF(F263=V263,\"\",1)","v":""},{"$f":"IF(G263=W263,\"\",1)","v":""},{"$f":"IF(H263=X263,\"\",1)","v":""},{"$f":"IF(I263=Y263,\"\",1)","v":""},{"$f":"IF(J263=Z263,\"\",1)","v":""},{"$f":"IF(K263=AA263,\"\",1)","v":""},{"$f":"IF(L263=AB263,\"\",1)","v":""},{"$f":"IF(M263=AC263,\"\",1)","v":""},{"$f":"IF(N263=AD263,\"\",1)","v":""},{"$f":"IF(O263=AE263,\"\",1)","v":""},{"$f":"IF(P263=AF263,\"\",1)","v":""},{"$f":"IF(Q263=AG263,\"\",1)","v":""}]
[null,259,"Ethylene glycol (vapour) (Ethane-1,2-diol)","107-21-1","1B",20,52,null,40,104,null,null,null,null,"Y",259,null,259,"Ethylene glycol (vapour) (Ethane-1,2-diol)","107-21-1","1B",20,52,null,40,104,null,null,null,null,"Y",259,null,"","","","","","","","","","","","","","",""]
[null,260,"Ethylene glycol dinitrate (EGDN, Ethylene dinitrate, Glycol dinitrate, Nitroglycol)","628-96-6",2,0.05,0.31,null,null,null,null,null,null,null,"Y",260,null,260,"Ethylene glycol dinitrate (EGDN, Ethylene dinitrate, Glycol dinitrate, Nitroglycol)","628-96-6",2,0.05,0.31,null,null,null,null,null,null,null,"Y",260,null,"","","","","","","","","","","","","","",""]
[null,261,"Ethylene oxide (Oxirane)","75-21-8",3,1,1.8,null,null,null,null,null,null,null,"Y",261,null,261,"Ethylene oxide (Oxirane)","75-21-8",3,1,1.8,null,null,null,null,null,null,null,"Y",261,null,"","","","","","","","","","","","","","",""]
[null,262,"Ethylenediamine (1,2-Diaminoethane)","107-15-3",3,10,25,null,null,null,null,null,null,null,"Y",262,null,262,"Ethylenediamine (1,2-Diaminoethane)","107-15-3",3,10,25,null,null,null,null,null,null,null,"Y",262,null,"","","","","","","","","","","","","","",""]
[null,263,"Ethylenimine (Aziridine)","151-56-4",4,0.5,0.88,null,null,null,null,null,null,null,"Y",263,null,263,"Ethylenimine (Aziridine)","151-56-4",4,0.5,0.88,null,null,null,null,null,null,null,"Y",263,null,"","","","","","","","","","","","","","",""]
[null,264,"Ethylidene norbornene","16219-75-3","1A",null,null,null,null,null,null,5,25,null,"N",264,null,264,"Ethylidene norbornene","16219-75-3","1A",null,null,null,null,null,null,5,25,null,"N",264,null,"","","","","","","","","","","","","","",""]
[null,265,"N-Ethylmorpholine","100-74-3",2,5,24,null,null,null,null,null,null,null,"Y",265,null,265,"N-Ethylmorpholine","100-74-3",2,5,24,null,null,null,null,null,null,null,"Y",265,null,"","","","","","","","","","","","","","",""]
[null,266,"Fenamiphos (Nemacur)","22224-92-6",4,null,0.1,null,null,null,null,null,null,null,"Y",266,null,266,"Fenamiphos (Nemacur)","22224-92-6",4,null,0.1,null,null,null,null,null,null,null,"Y",266,null,"","","","","","","","","","","","","","",""]
[null,267,"Fensulfothion (Dasanit)","115-90-2",4,null,0.1,null,null,null,null,null,null,null,"Y",267,null,267,"Fensulfothion (Dasanit)","115-90-2",4,null,0.1,null,null,null,null,null,null,null,"Y",267,null,"","","","","","","","","","","","","","",""]
[null,268,"Fenthion (Baytex, Lebaycid)","55-38-9",4,null,0.2,null,null,null,null,null,null,null,"Y",268,null,268,"Fenthion (Baytex, Lebaycid)","55-38-9",4,null,0.2,null,null,null,null,null,null,null,"Y",268,null,"","","","","","","","","","","","","","",""]
[null,269,"Ferbam","14484-64-1",3,null,10,null,null,null,null,null,null,null,"Y",269,null,269,"Ferbam","14484-64-1",3,null,10,null,null,null,null,null,null,null,"Y",269,null,"","","","","","","","","","","","","","",""]
[null,270,"Ferrovanadium dust","12604-58-9","1B",null,1,null,null,3,null,null,null,null,"Y",270,null,270,"Ferrovanadium dust","12604-58-9","1B",null,1,null,null,3,null,null,null,null,"Y",270,null,"","","","","","","","","","","","","","",""]
[null,271,"Fluorides (as F)",null,3,null,2.5,null,null,null,null,null,null,null,"Y",271,null,271,"Fluorides (as F)",null,3,null,2.5,null,null,null,null,null,null,null,"Y",271,null,"","","","","","","","","","","","","","",""]
[null,272,"Fluorine","7782-41-4","1B",1,1.6,null,2,3.1,null,null,null,null,"Y",272,null,272,"Fluorine","7782-41-4","1B",1,1.6,null,2,3.1,null,null,null,null,"Y",272,null,"","","","","","","","","","","","","","",""]
[null,273,"Fonofos (Dyfonate)","944-22-9",4,null,0.1,null,null,null,null,null,null,null,"Y",273,null,273,"Fonofos (Dyfonate)","944-22-9",4,null,0.1,null,null,null,null,null,null,null,"Y",273,null,"","","","","","","","","","","","","","",""]
[null,274,"Formaldehyde ","50-00-0",4,1,1.2,null,2,2.5,null,null,null,null,"Y",274,null,274,"Formaldehyde ","50-00-0",4,1,1.2,null,2,2.5,null,null,null,null,"Y",274,null,"","","","","","","","","","","","","","",""]
[null,275,"Formamide","75-12-7",3,10,18,null,null,null,null,null,null,null,"Y",275,null,275,"Formamide","75-12-7",3,10,18,null,null,null,null,null,null,null,"Y",275,null,"","","","","","","","","","","","","","",""]
[null,276,"Formic acid","64-18-6","1B",5,9.4,null,10,19,null,null,null,null,"Y",276,null,276,"Formic acid","64-18-6","1B",5,9.4,null,10,19,null,null,null,null,"Y",276,null,"","","","","","","","","","","","","","",""]
[null,277,"Fumed silica (respirable dust)","7631-86-9",3,null,2,null,null,null,null,null,null,null,"Y",277,null,277,"Fumed silica (respirable dust)","7631-86-9",3,null,2,null,null,null,null,null,null,null,"Y",277,null,"","","","","","","","","","","","","","",""]
[null,278,"Furfural (2-Furaldehyde)","98-01-1","1B",2,7.9,null,null,null,null,null,null,null,"Y",278,null,278,"Furfural (2-Furaldehyde)","98-01-1","1B",2,7.9,null,null,null,null,null,null,null,"Y",278,null,"","","","","","","","","","","","","","",""]
[null,279,"Furfuryl alcohol","98-00-0","1B",10,40,null,15,60,null,null,null,null,"Y",279,null,279,"Furfuryl alcohol","98-00-0","1B",10,40,null,15,60,null,null,null,null,"Y",279,null,"","","","","","","","","","","","","","",""]
[null,280,"Germanium tetrahydride (Germane)","7782-65-2",2,0.2,0.63,null,null,null,null,null,null,null,"Y",280,null,280,"Germanium tetrahydride (Germane)","7782-65-2",2,0.2,0.63,null,null,null,null,null,null,null,"Y",280,null,"","","","","","","","","","","","","","",""]
[null,281,"Glutaraldehyde (1,5-Pentanedial)","111-30-8",4,null,null,null,null,null,null,0.1,0.41,null,"N",281,null,281,"Glutaraldehyde (1,5-Pentanedial)","111-30-8",4,null,null,null,null,null,null,0.1,0.41,null,"N",281,null,"","","","","","","","","","","","","","",""]
[null,282,"Glycerin mist ","56-81-5","1C",null,10,null,null,null,null,null,null,null,"Y",282,null,282,"Glycerin mist ","56-81-5","1C",null,10,null,null,null,null,null,null,null,"Y",282,null,"","","","","","","","","","","","","","",""]
[null,283,"Glycidol (2,3-Epoxy-1-propanol)","556-52-5",4,25,76,null,null,null,null,null,null,null,"Y",283,null,283,"Glycidol (2,3-Epoxy-1-propanol)","556-52-5",4,25,76,null,null,null,null,null,null,null,"Y",283,null,"","","","","","","","","","","","","","",""]
[null,284,"Grain dust (oats,wheat, barley)",null,4,null,4,null,null,null,null,null,null,null,"Y",284,null,284,"Grain dust (oats,wheat, barley)",null,4,null,4,null,null,null,null,null,null,null,"Y",284,null,"","","","","","","","","","","","","","",""]
[null,285,"Graphite (all forms except fibres) (respirable dust) (natural & synthetic)","7782-42-5",3,null,3,null,null,null,null,null,null,null,"Y",285,null,285,"Graphite (all forms except fibres) (respirable dust) (natural & synthetic)","7782-42-5",3,null,3,null,null,null,null,null,null,null,"Y",285,null,"","","","","","","","","","","","","","",""]
[null,286,"Hafnium","7440-58-6",3,null,0.5,null,null,null,null,null,null,null,"Y",286,null,286,"Hafnium","7440-58-6",3,null,0.5,null,null,null,null,null,null,null,"Y",286,null,"","","","","","","","","","","","","","",""]
[null,287,"Halothane (1,1,1-Trifluoro-2-chloro-2-bromoethane)","151-67-7",4,0.5,4.0999999999999996,null,null,null,null,null,null,null,"Y",287,null,287,"Halothane (1,1,1-Trifluoro-2-chloro-2-bromoethane)","151-67-7",4,0.5,4.0999999999999996,null,null,null,null,null,null,null,"Y",287,null,"","","","","","","","","","","","","","",""]
[null,288,"Heptachlor ","76-44-8",4,null,0.5,null,null,null,null,null,null,null,"Y",288,null,288,"Heptachlor ","76-44-8",4,null,0.5,null,null,null,null,null,null,null,"Y",288,null,"","","","","","","","","","","","","","",""]
[null,289,"Heptane (n-Heptane)","142-82-5",2,400,1640,null,500,2050,null,null,null,null,"Y",289,null,289,"Heptane (n-Heptane)","142-82-5",2,400,1640,null,500,2050,null,null,null,null,"Y",289,null,"","","","","","","","","","","","","","",""]
[null,290,"Hexachlorobutadiene","87-68-3",3,0.02,0.21,null,null,null,null,null,null,null,"Y",290,null,290,"Hexachlorobutadiene","87-68-3",3,0.02,0.21,null,null,null,null,null,null,null,"Y",290,null,"","","","","","","","","","","","","","",""]
[null,291,"Hexachlorocyclopentadiene","77-47-4",4,0.01,0.11,null,null,null,null,null,null,null,"Y",291,null,291,"Hexachlorocyclopentadiene","77-47-4",4,0.01,0.11,null,null,null,null,null,null,null,"Y",291,null,"","","","","","","","","","","","","","",""]
[null,292,"Hexachloroethane","67-72-1",3,1,9.6999999999999993,null,null,null,null,null,null,null,"Y",292,null,292,"Hexachloroethane","67-72-1",3,1,9.6999999999999993,null,null,null,null,null,null,null,"Y",292,null,"","","","","","","","","","","","","","",""]
[null,293,"Hexachloronaphthalene","1335-87-1",3,null,0.2,null,null,null,null,null,null,null,"Y",293,null,293,"Hexachloronaphthalene","1335-87-1",3,null,0.2,null,null,null,null,null,null,null,"Y",293,null,"","","","","","","","","","","","","","",""]
[null,294,"Hexafluoroacetone","684-16-2",4,0.1,0.68,null,null,null,null,null,null,null,"Y",294,null,294,"Hexafluoroacetone","684-16-2",4,0.1,0.68,null,null,null,null,null,null,null,"Y",294,null,"","","","","","","","","","","","","","",""]
[null,295,"Hexamethylene diisocyanate (HDI)","822-06-0",3,null,0.02,null,null,7.0000000000000007E-2,null,null,null,null,"Y",295,null,295,"Hexamethylene diisocyanate (HDI)","822-06-0",3,null,0.02,null,null,7.0000000000000007E-2,null,null,null,null,"Y",295,null,"","","","","","","","","","","","","","",""]
[null,296,"Hexane (n-Hexane)","110-54-3",4,20,72,null,null,null,null,null,null,null,"Y",296,null,296,"Hexane (n-Hexane)","110-54-3",4,20,72,null,null,null,null,null,null,null,"Y",296,null,"","","","","","","","","","","","","","",""]
[null,297,"Hexane, other isomers",null,"1C",500,1760,null,1000,3500,null,null,null,null,"Y",297,null,297,"Hexane, other isomers",null,"1C",500,1760,null,1000,3500,null,null,null,null,"Y",297,null,"","","","","","","","","","","","","","",""]
[null,298,"sec-Hexyl acetate (1,3-Dimethyl butyl acetate)","108-84-9","1B",50,295,null,null,null,null,null,null,null,"Y",298,null,298,"sec-Hexyl acetate (1,3-Dimethyl butyl acetate)","108-84-9","1B",50,295,null,null,null,null,null,null,null,"Y",298,null,"","","","","","","","","","","","","","",""]
[null,299,"Hexylene glycol (2-Methylpentane-2,4-diol)","107-41-5","1A",null,null,null,null,null,null,25,121,null,"N",299,null,299,"Hexylene glycol (2-Methylpentane-2,4-diol)","107-41-5","1A",null,null,null,null,null,null,25,121,null,"N",299,null,"","","","","","","","","","","","","","",""]
[null,300,"Hydrazine (Diamine)","302-01-2",3,0.01,1.2999999999999999E-2,null,null,null,null,null,null,null,"Y",300,null,300,"Hydrazine (Diamine)","302-01-2",3,0.01,1.2999999999999999E-2,null,null,null,null,null,null,null,"Y",300,null,"","","","","","","","","","","","","","",""]
[null,301,"Hydrogen bromide","10035-10-6","1A",null,null,null,null,null,null,3,9.9,null,"N",301,null,301,"Hydrogen bromide","10035-10-6","1A",null,null,null,null,null,null,3,9.9,null,"N",301,null,"","","","","","","","","","","","","","",""]
[null,302,"Hydrogen chloride (Hydrochloric acid)","7647-01-0","1A",null,null,null,null,null,null,5,7.5,null,"N",302,null,302,"Hydrogen chloride (Hydrochloric acid)","7647-01-0","1A",null,null,null,null,null,null,5,7.5,null,"N",302,null,"","","","","","","","","","","","","","",""]
[null,303,"Hydrogen cyanide (Hydrocyanic acid)","74-90-8","1A",null,null,null,null,null,null,10,11,null,"N",303,null,303,"Hydrogen cyanide (Hydrocyanic acid)","74-90-8","1A",null,null,null,null,null,null,10,11,null,"N",303,null,"","","","","","","","","","","","","","",""]
[null,304,"Hydrogen fluoride (as F)","7664-39-3","1A",null,null,null,null,null,null,3,2.6,null,"N",304,null,304,"Hydrogen fluoride (as F)","7664-39-3","1A",null,null,null,null,null,null,3,2.6,null,"N",304,null,"","","","","","","","","","","","","","",""]
[null,305,"Hydrogen peroxide","7722-84-1","1B",1,1.4,null,null,null,null,null,null,null,"Y",305,null,305,"Hydrogen peroxide","7722-84-1","1B",1,1.4,null,null,null,null,null,null,null,"Y",305,null,"","","","","","","","","","","","","","",""]
[null,306,"Hydrogen selenide (as Se)","7783-07-5",4,0.05,0.16,null,null,null,null,null,null,null,"Y",306,null,306,"Hydrogen selenide (as Se)","7783-07-5",4,0.05,0.16,null,null,null,null,null,null,null,"Y",306,null,"","","","","","","","","","","","","","",""]
[null,307,"Hydrogen sulphide","7783-06-4","1C",10,14,null,15,21,null,null,null,null,"Y",307,null,307,"Hydrogen sulphide","7783-06-4","1C",10,14,null,15,21,null,null,null,null,"Y",307,null,"","","","","","","","","","","","","","",""]
[null,308,"Hydrogenated terphenyls","37275-59-5",3,0.5,4.9000000000000004,null,null,null,null,null,null,null,"Y",308,null,308,"Hydrogenated terphenyls","37275-59-5",3,0.5,4.9000000000000004,null,null,null,null,null,null,null,"Y",308,null,"","","","","","","","","","","","","","",""]
[null,309,"Hydroquinone (p-Dihydroxybenzene)","123-31-9",4,null,2,null,null,null,null,null,null,null,"Y",309,null,309,"Hydroquinone (p-Dihydroxybenzene)","123-31-9",4,null,2,null,null,null,null,null,null,null,"Y",309,null,"","","","","","","","","","","","","","",""]
[null,310,"2-Hydroxypropyl acrylate","999-61-1",4,0.5,2.8,null,null,null,null,null,null,null,"Y",310,null,310,"2-Hydroxypropyl acrylate","999-61-1",4,0.5,2.8,null,null,null,null,null,null,null,"Y",310,null,"","","","","","","","","","","","","","",""]
[null,311,"Indene","95-13-6",4,10,48,null,null,null,null,null,null,null,"Y",311,null,311,"Indene","95-13-6",4,10,48,null,null,null,null,null,null,null,"Y",311,null,"","","","","","","","","","","","","","",""]
[null,312,"Indium & compounds (as In)","7440-74-6",4,null,0.1,null,null,null,null,null,null,null,"Y",312,null,312,"Indium & compounds (as In)","7440-74-6",4,null,0.1,null,null,null,null,null,null,null,"Y",312,null,"","","","","","","","","","","","","","",""]
[null,313,"Iodine","7553-56-2","1A",null,null,null,null,null,null,0.1,1,null,"N",313,null,313,"Iodine","7553-56-2","1A",null,null,null,null,null,null,0.1,1,null,"N",313,null,"","","","","","","","","","","","","","",""]
[null,314,"Iodoform","75-47-8",2,0.6,10,null,null,null,null,null,null,null,"Y",314,null,314,"Iodoform","75-47-8",2,0.6,10,null,null,null,null,null,null,null,"Y",314,null,"","","","","","","","","","","","","","",""]
[null,315,"Iron oxide fume (Fe2O3) (as Fe)","1309-37-1",3,null,5,null,null,null,null,null,null,null,"Y",315,null,315,"Iron oxide fume (Fe2O3) (as Fe)","1309-37-1",3,null,5,null,null,null,null,null,null,null,"Y",315,null,"","","","","","","","","","","","","","",""]
[null,316,"Iron pentacarbonyl (as Fe)","13463-40-6",2,0.1,0.23,null,0.2,0.45,null,null,null,null,"Y",316,null,316,"Iron pentacarbonyl (as Fe)","13463-40-6",2,0.1,0.23,null,0.2,0.45,null,null,null,null,"Y",316,null,"","","","","","","","","","","","","","",""]
[null,317,"Iron salts, soluble (as Fe)",null,"1B",null,1,null,null,null,null,null,null,null,"Y",317,null,317,"Iron salts, soluble (as Fe)",null,"1B",null,1,null,null,null,null,null,null,null,"Y",317,null,"","","","","","","","","","","","","","",""]
[null,318,"Isoamyl acetate (Isopentyl acetate)","123-92-2","1B",50,270,null,100,541,null,null,null,null,"Y",318,null,318,"Isoamyl acetate (Isopentyl acetate)","123-92-2","1B",50,270,null,100,541,null,null,null,null,"Y",318,null,"","","","","","","","","","","","","","",""]
[null,319,"Isoamyl alcohol (3-Methylbutan-1-ol)","123-51-3",2,100,361,null,125,452,null,null,null,null,"Y",319,null,319,"Isoamyl alcohol (3-Methylbutan-1-ol)","123-51-3",2,100,361,null,125,452,null,null,null,null,"Y",319,null,"","","","","","","","","","","","","","",""]
[null,320,"Isobutyl acetate","110-19-0","1B",150,713,null,null,null,null,null,null,null,"Y",320,null,320,"Isobutyl acetate","110-19-0","1B",150,713,null,null,null,null,null,null,null,"Y",320,null,"","","","","","","","","","","","","","",""]
[null,321,"Isobutyl alcohol (2-Methylpropan-1-ol; iso-Butanol)","78-83-1","1B",50,152,null,null,null,null,null,null,null,{"$f":"IF(COUNTA(F326:H326)=0,\"N\",\"Y\")","v":"Y"},{"$f":"B326","v":321},null,321,"Isobutyl alcohol (2-Methylpropan-1-ol; iso-Butanol)","78-83-1","1B",50,152,null,null,null,null,null,null,null,{"$f":"IF(COUNTA(V326:X326)=0,\"N\",\"Y\")","v":"Y"},{"$f":"R326","v":321},null,"","","","","","","","","","","","","","",""]
[null,322,"Isocyanates, all (as-NCO)",null,3,null,0.02,null,null,7.0000000000000007E-2,null,null,null,null,"Y",322,null,322,"Isocyanates, all (as-NCO)",null,3,null,0.02,null,null,7.0000000000000007E-2,null,null,null,null,"Y",322,null,{"$f":"IF(C327=S327,\"\",1)","v":""},{"$f":"IF(D327=T327,\"\",1)","v":""},{"$f":"IF(E327=U327,\"\",1)","v":""},{"$f":"IF(F327=V327,\"\",1)","v":""},{"$f":"IF(G327=W327,\"\",1)","v":""},{"$f":"IF(H327=X327,\"\",1)","v":""},{"$f":"IF(I327=Y327,\"\",1)","v":""},{"$f":"IF(J327=Z327,\"\",1)","v":""},{"$f":"IF(K327=AA327,\"\",1)","v":""},{"$f":"IF(L327=AB327,\"\",1)","v":""},{"$f":"IF(M327=AC327,\"\",1)","v":""},{"$f":"IF(N327=AD327,\"\",1)","v":""},{"$f":"IF(O327=AE327,\"\",1)","v":""},{"$f":"IF(P327=AF327,\"\",1)","v":""},{"$f":"IF(Q327=AG327,\"\",1)","v":""}]
[null,323,"Isooctyl alcohol","26952-21-6",2,50,266,null,null,null,null,null,null,null,"Y",323,null,323,"Isooctyl alcohol","26952-21-6",2,50,266,null,null,null,null,null,null,null,"Y",323,null,"","","","","","","","","","","","","","",""]
[null,324,"Isophorone (3,5,5-Trimethylcyclohex-2-enone)","78-59-1","1A",null,null,null,null,null,null,5,28,null,"N",324,null,324,"Isophorone (3,5,5-Trimethylcyclohex-2-enone)","78-59-1","1A",null,null,null,null,null,null,5,28,null,"N",324,null,"","","","","","","","","","","","","","",""]
[null,325,"Isophorone diisocyanate","4098-71-9",3,null,0.02,null,null,7.0000000000000007E-2,null,null,null,null,"Y",325,null,325,"Isophorone diisocyanate","4098-71-9",3,null,0.02,null,null,7.0000000000000007E-2,null,null,null,null,"Y",325,null,"","","","","","","","","","","","","","",""]
[null,326,"Isopropoxyethanol","109-59-1",3,25,106,null,null,null,null,null,null,null,"Y",326,null,326,"Isopropoxyethanol","109-59-1",3,25,106,null,null,null,null,null,null,null,"Y",326,null,"","","","","","","","","","","","","","",""]
[null,327,"Isopropyl acetate","108-21-4","1B",250,1040,null,310,1290,null,null,null,null,"Y",327,null,327,"Isopropyl acetate","108-21-4","1B",250,1040,null,310,1290,null,null,null,null,"Y",327,null,"","","","","","","","","","","","","","",""]
[null,328,"Isopropyl alcohol (Propan-2-ol)","67-63-0",2,400,983,null,500,1230,null,null,null,null,"Y",328,null,328,"Isopropyl alcohol (Propan-2-ol)","67-63-0",2,400,983,null,500,1230,null,null,null,null,"Y",328,null,"","","","","","","","","","","","","","",""]
[null,329,"Isopropyl ether (Diisopropyl ether)","108-20-3","1B",250,1040,null,310,1300,null,null,null,null,"Y",329,null,329,"Isopropyl ether (Diisopropyl ether)","108-20-3","1B",250,1040,null,310,1300,null,null,null,null,"Y",329,null,"","","","","","","","","","","","","","",""]
[null,330,"Isopropyl glycidyl ether (IGE, 2,3-Epoxypropyl isopropyl ether)","4016-14-2",3,50,238,null,75,356,null,null,null,null,"Y",330,null,330,"Isopropyl glycidyl ether (IGE, 2,3-Epoxypropyl isopropyl ether)","4016-14-2",3,50,238,null,75,356,null,null,null,null,"Y",330,null,"","","","","","","","","","","","","","",""]
[null,331,"Isopropylamine (2-Aminopropane)","75-31-0","1B",5,12,null,10,24,null,null,null,null,"Y",331,null,331,"Isopropylamine (2-Aminopropane)","75-31-0","1B",5,12,null,10,24,null,null,null,null,"Y",331,null,"","","","","","","","","","","","","","",""]
[null,332,"N-Isopropylaniline","768-52-5",2,2,11,null,null,null,null,null,null,null,"Y",332,null,332,"N-Isopropylaniline","768-52-5",2,2,11,null,null,null,null,null,null,null,"Y",332,null,"","","","","","","","","","","","","","",""]
[null,333,"Kaolin ","1332-58-7",3,null,10,null,null,null,null,null,null,null,"Y",333,null,333,"Kaolin ","1332-58-7",3,null,10,null,null,null,null,null,null,null,"Y",333,null,"","","","","","","","","","","","","","",""]
[null,334,"Ketene","463-51-4",2,0.5,0.86,null,1.5,2.6,null,null,null,null,"Y",334,null,334,"Ketene","463-51-4",2,0.5,0.86,null,1.5,2.6,null,null,null,null,"Y",334,null,"","","","","","","","","","","","","","",""]
[null,335,"Lead arsenate (as Pb3(AsO4)2)","3687-31-8",4,null,0.15,null,null,null,null,null,null,null,"Y",335,null,335,"Lead arsenate (as Pb3(AsO4)2)","3687-31-8",4,null,0.15,null,null,null,null,null,null,null,"Y",335,null,"","","","","","","","","","","","","","",""]
[null,336,"Lead chromate (as Cr) ","7758-97-6",3,null,0.05,null,null,null,null,null,null,null,"Y",336,null,336,"Lead chromate (as Cr) ","7758-97-6",3,null,0.05,null,null,null,null,null,null,null,"Y",336,null,"","","","","","","","","","","","","","",""]
[null,337,"Lead, inorganic dusts & fumes (as Pb)","7439-92-1",3,null,0.15,null,null,null,null,null,null,null,"Y",337,null,337,"Lead, inorganic dusts & fumes (as Pb)","7439-92-1",3,null,0.15,null,null,null,null,null,null,null,"Y",337,null,"","","","","","","","","","","","","","",""]
[null,338,"Lindane (Gammexane, gamma-Hexachlorocyclohexane)","58-89-9",4,8.0000000000000002E-3,0.1,null,null,null,null,null,null,null,"Y",338,null,338,"Lindane (Gammexane, gamma-Hexachlorocyclohexane)","58-89-9",4,8.0000000000000002E-3,0.1,null,null,null,null,null,null,null,"Y",338,null,"","","","","","","","","","","","","","",""]
[null,339,"Lithium hydride","7580-67-8","1B",null,2.5000000000000001E-2,null,null,null,null,null,null,null,"Y",339,null,339,"Lithium hydride","7580-67-8","1B",null,2.5000000000000001E-2,null,null,null,null,null,null,null,"Y",339,null,"","","","","","","","","","","","","","",""]
[null,340,"LPG (liquified petroleum gas)","68476-85-7","1C",1000,1800,null,null,null,null,null,null,null,"Y",340,null,340,"LPG (liquified petroleum gas)","68476-85-7","1C",1000,1800,null,null,null,null,null,null,null,"Y",340,null,"","","","","","","","","","","","","","",""]
[null,341,"Magnesite ","546-93-0","1C",null,10,null,null,null,null,null,null,null,"Y",341,null,341,"Magnesite ","546-93-0","1C",null,10,null,null,null,null,null,null,null,"Y",341,null,"","","","","","","","","","","","","","",""]
[null,342,"Magnesium oxide (fume)","1309-48-4",2,null,10,null,null,null,null,null,null,null,"Y",342,null,342,"Magnesium oxide (fume)","1309-48-4",2,null,10,null,null,null,null,null,null,null,"Y",342,null,"","","","","","","","","","","","","","",""]
[null,343,"Malathion (Maldison)","121-75-5",4,null,10,null,null,null,null,null,null,null,"Y",343,null,343,"Malathion (Maldison)","121-75-5",4,null,10,null,null,null,null,null,null,null,"Y",343,null,"","","","","","","","","","","","","","",""]
[null,344,"Maleic anhydride","108-31-6",4,0.25,1,null,null,null,null,null,null,null,"Y",344,null,344,"Maleic anhydride","108-31-6",4,0.25,1,null,null,null,null,null,null,null,"Y",344,null,"","","","","","","","","","","","","","",""]
[null,345,"Manganese cyclopenta-dienyl tricarbonyl (as Mn)","12079-65-1",4,null,0.1,null,null,null,null,null,null,null,"Y",345,null,345,"Manganese cyclopenta-dienyl tricarbonyl (as Mn)","12079-65-1",4,null,0.1,null,null,null,null,null,null,null,"Y",345,null,"","","","","","","","","","","","","","",""]
[null,346,"Manganese, dust & compounds (as Mn)","7439-96-5",3,null,1,null,null,null,null,null,null,null,"Y",346,null,346,"Manganese, dust & compounds (as Mn)","7439-96-5",3,null,1,null,null,null,null,null,null,null,"Y",346,null,"","","","","","","","","","","","","","",""]
[null,347,"Manganese, fume (as Mn) (Manganese tetroxide)","7439-96-5",3,null,1,null,null,3,null,null,null,null,"Y",347,null,347,"Manganese, fume (as Mn) (Manganese tetroxide)","7439-96-5",3,null,1,null,null,3,null,null,null,null,"Y",347,null,"","","","","","","","","","","","","","",""]
[null,348,"Man-Made Vitreous (Silicate) Fibres - Continuous glass filament",null,"1B",null,2,null,null,null,null,null,null,null,"Y",348,null,348,"Man-Made Vitreous (Silicate) Fibres - Continuous glass filament",null,"1B",null,2,null,null,null,null,null,null,null,"Y",348,null,"","","","","","","","","","","","","","",""]
[null,349,"Man-Made Vitreous (Silicate) Fibres - Glass wool",null,"1B",null,2,null,null,null,null,null,null,null,"Y",349,null,349,"Man-Made Vitreous (Silicate) Fibres - Glass wool",null,"1B",null,2,null,null,null,null,null,null,null,"Y",349,null,"","","","","","","","","","","","","","",""]
[null,350,"Man-Made Vitreous (Silicate) Fibres - High Biopersistence MMVF",null,3,null,2,0.5,null,null,null,null,null,null,"Y",350,null,350,"Man-Made Vitreous (Silicate) Fibres - High Biopersistence MMVF",null,3,null,2,0.5,null,null,null,null,null,null,"Y",350,null,"","","","","","","","","","","","","","",""]
[null,351,"Man-Made Vitreous (Silicate) Fibres - Low Biopersistence MMVF",null,"1B",null,2,null,null,null,null,null,null,null,"Y",351,null,351,"Man-Made Vitreous (Silicate) Fibres - Low Biopersistence MMVF",null,"1B",null,2,null,null,null,null,null,null,null,"Y",351,null,"","","","","","","","","","","","","","",""]
[null,352,"Man-Made Vitreous (Silicate) Fibres - Refractory Ceramic Fibres (RCF)",null,3,null,2,0.5,null,null,null,null,null,null,"Y",352,null,352,"Man-Made Vitreous (Silicate) Fibres - Refractory Ceramic Fibres (RCF)",null,3,null,2,0.5,null,null,null,null,null,null,"Y",352,null,"","","","","","","","","","","","","","",""]
[null,353,"Man-Made Vitreous (Silicate) Fibres - Rock (stone) wool",null,"1B",null,2,null,null,null,null,null,null,null,"Y",353,null,353,"Man-Made Vitreous (Silicate) Fibres - Rock (stone) wool",null,"1B",null,2,null,null,null,null,null,null,null,"Y",353,null,"","","","","","","","","","","","","","",""]
[null,354,"Man-Made Vitreous (Silicate) Fibres - Slag wool",null,"1B",null,2,null,null,null,null,null,null,null,"Y",354,null,354,"Man-Made Vitreous (Silicate) Fibres - Slag wool",null,"1B",null,2,null,null,null,null,null,null,null,"Y",354,null,"","","","","","","","","","","","","","",""]
[null,355,"Man-Made Vitreous (Silicate) Fibres - Special Purpose Glass Fibres",null,3,null,2,0.5,null,null,null,null,null,null,"Y",355,null,355,"Man-Made Vitreous (Silicate) Fibres - Special Purpose Glass Fibres",null,3,null,2,0.5,null,null,null,null,null,null,"Y",355,null,"","","","","","","","","","","","","","",""]
[null,356,"Mercury, alkyl compounds (as Hg)",null,4,null,0.01,null,null,0.03,null,null,null,null,"Y",356,null,356,"Mercury, alkyl compounds (as Hg)",null,4,null,0.01,null,null,0.03,null,null,null,null,"Y",356,null,"","","","","","","","","","","","","","",""]
[null,357,"Mercury, aryl compounds (as Hg)",null,3,null,0.1,null,null,null,null,null,null,null,"Y",357,null,357,"Mercury, aryl compounds (as Hg)",null,3,null,0.1,null,null,null,null,null,null,null,"Y",357,null,"","","","","","","","","","","","","","",""]
[null,358,"Mercury, elemental vapour (as Hg)","7439-97-6",3,3.0000000000000001E-3,2.5000000000000001E-2,null,null,null,null,null,null,null,"Y",358,null,358,"Mercury, elemental vapour (as Hg)","7439-97-6",3,3.0000000000000001E-3,2.5000000000000001E-2,null,null,null,null,null,null,null,"Y",358,null,"","","","","","","","","","","","","","",""]
[null,359,"Mercury, inorganic divalent compounds (as Hg)","7439-97-6",3,3.0000000000000001E-3,2.5000000000000001E-2,null,null,null,null,null,null,null,"Y",359,null,359,"Mercury, inorganic divalent compounds (as Hg)","7439-97-6",3,3.0000000000000001E-3,2.5000000000000001E-2,null,null,null,null,null,null,null,"Y",359,null,"","","","","","","","","","","","","","",""]
[null,360,"Mercury, inorganic monovalent compounds (as Hg)",null,3,null,0.1,null,null,null,null,null,null,null,"Y",360,null,360,"Mercury, inorganic monovalent compounds (as Hg)",null,3,null,0.1,null,null,null,null,null,null,null,"Y",360,null,"","","","","","","","","","","","","","",""]
[null,361,"Mesityl oxide (4-Methylpent-3-en-2-one)","141-79-7","1B",15,60,null,25,100,null,null,null,null,"Y",361,null,361,"Mesityl oxide (4-Methylpent-3-en-2-one)","141-79-7","1B",15,60,null,25,100,null,null,null,null,"Y",361,null,"","","","","","","","","","","","","","",""]
[null,362,"Methacrylic acid","79-41-4","1B",20,70,null,null,null,null,null,null,null,"Y",362,null,362,"Methacrylic acid","79-41-4","1B",20,70,null,null,null,null,null,null,null,"Y",362,null,"","","","","","","","","","","","","","",""]
[null,363,"Methomyl (Lannate)","16752-77-5",4,null,2.5,null,null,null,null,null,null,null,"Y",363,null,363,"Methomyl (Lannate)","16752-77-5",4,null,2.5,null,null,null,null,null,null,null,"Y",363,null,"","","","","","","","","","","","","","",""]
[null,364,"1-Methoxy-2-propanol acetate","108-65-6","1B",50,274,null,100,548,null,null,null,null,"Y",364,null,364,"1-Methoxy-2-propanol acetate","108-65-6","1B",50,274,null,100,548,null,null,null,null,"Y",364,null,"","","","","","","","","","","","","","",""]
[null,365,"Methoxychlor (2,2-bis(p-Methoxyphenyl)-1,1,1-trichloroethane; DMDT)","72-43-5",3,null,10,null,null,null,null,null,null,null,"Y",365,null,365,"Methoxychlor (2,2-bis(p-Methoxyphenyl)-1,1,1-trichloroethane; DMDT)","72-43-5",3,null,10,null,null,null,null,null,null,null,"Y",365,null,"","","","","","","","","","","","","","",""]
[null,366,"2-Methoxyethanol (Methyl cellosolve, Methyl gylcol, Glycol monomethyl ether, Ethylene glycol monomethyl ether)","109-86-4",4,5,16,null,null,null,null,null,null,null,"Y",366,null,366,"2-Methoxyethanol (Methyl cellosolve, Methyl gylcol, Glycol monomethyl ether, Ethylene glycol monomethyl ether)","109-86-4",4,5,16,null,null,null,null,null,null,null,"Y",366,null,"","","","","","","","","","","","","","",""]
[null,367,"2-Methoxyethyl acetate (Ethylene glycol monomethyl ether acetate, Glycol monomethyl ether acetate, Methyl glycol acetate, Methyl cellosolve acetate)","110-49-6",4,5,24,null,null,null,null,null,null,null,"Y",367,null,367,"2-Methoxyethyl acetate (Ethylene glycol monomethyl ether acetate, Glycol monomethyl ether acetate, Methyl glycol acetate, Methyl cellosolve acetate)","110-49-6",4,5,24,null,null,null,null,null,null,null,"Y",367,null,"","","","","","","","","","","","","","",""]
[null,368,"(2-Methoxymethylethoxy) propenol (Dipropylene glycol (mono) methyl ether)","34590-94-8",2,50,308,null,null,null,null,null,null,null,"Y",368,null,368,"(2-Methoxymethylethoxy) propenol (Dipropylene glycol (mono) methyl ether)","34590-94-8",2,50,308,null,null,null,null,null,null,null,"Y",368,null,"","","","","","","","","","","","","","",""]
[null,369,"4-Methoxyphenol (Mequinol (INN))","150-76-5",4,null,5,null,null,null,null,null,null,null,"Y",369,null,369,"4-Methoxyphenol (Mequinol (INN))","150-76-5",4,null,5,null,null,null,null,null,null,null,"Y",369,null,"","","","","","","","","","","","","","",""]
[null,370,"Methyl 2-cyanoacrylate","137-05-3","1B",2,9.1,null,4,18,null,null,null,null,"Y",370,null,370,"Methyl 2-cyanoacrylate","137-05-3","1B",2,9.1,null,4,18,null,null,null,null,"Y",370,null,"","","","","","","","","","","","","","",""]
[null,371,"Methyl acetate","79-20-9",2,200,606,null,250,757,null,null,null,null,"Y",371,null,371,"Methyl acetate","79-20-9",2,200,606,null,250,757,null,null,null,null,"Y",371,null,"","","","","","","","","","","","","","",""]
[null,372,"Methyl acetylene (Propyne)","74-99-7","1C",1000,1640,null,null,null,null,null,null,null,"Y",372,null,372,"Methyl acetylene (Propyne)","74-99-7","1C",1000,1640,null,null,null,null,null,null,null,"Y",372,null,"","","","","","","","","","","","","","",""]
[null,373,"Methyl acetylene-propadiene mixture (MAPP)","59355-75-8","1C",1000,1640,null,1250,2050,null,null,null,null,"Y",373,null,373,"Methyl acetylene-propadiene mixture (MAPP)","59355-75-8","1C",1000,1640,null,1250,2050,null,null,null,null,"Y",373,null,"","","","","","","","","","","","","","",""]
[null,374,"Methyl acrylate (Acrylic acid, methyl ester)","96-33-3",3,10,35,null,null,null,null,null,null,null,"Y",374,null,374,"Methyl acrylate (Acrylic acid, methyl ester)","96-33-3",3,10,35,null,null,null,null,null,null,null,"Y",374,null,"","","","","","","","","","","","","","",""]
[null,375,"Methyl alcohol (Methanol)","67-56-1",4,200,262,null,250,328,null,null,null,null,"Y",375,null,375,"Methyl alcohol (Methanol)","67-56-1",4,200,262,null,250,328,null,null,null,null,"Y",375,null,"","","","","","","","","","","","","","",""]
[null,376,"N-Methyl aniline","100-61-8",4,0.5,2.2000000000000002,null,null,null,null,null,null,null,"Y",376,null,376,"N-Methyl aniline","100-61-8",4,0.5,2.2000000000000002,null,null,null,null,null,null,null,"Y",376,null,"","","","","","","","","","","","","","",""]
[null,377,"Methyl bromide (Bromomethane)","74-83-9",4,5,19,null,null,null,null,null,null,null,"Y",377,null,377,"Methyl bromide (Bromomethane)","74-83-9",4,5,19,null,null,null,null,null,null,null,"Y",377,null,"","","","","","","","","","","","","","",""]
[null,378,"Methyl chloride (Chloromethane)","74-87-3",4,50,103,null,100,207,null,null,null,null,"Y",378,null,378,"Methyl chloride (Chloromethane)","74-87-3",4,50,103,null,100,207,null,null,null,null,"Y",378,null,"","","","","","","","","","","","","","",""]
[null,379,"Methyl demeton (Demeton-O-methyl plus demeton-S-methyl; Metasystox)","8022-00-2",4,null,0.5,null,null,null,null,null,null,null,"Y",379,null,379,"Methyl demeton (Demeton-O-methyl plus demeton-S-methyl; Metasystox)","8022-00-2",4,null,0.5,null,null,null,null,null,null,null,"Y",379,null,"","","","","","","","","","","","","","",""]
[null,380,"Methyl ethyl ketone (MEK, 2-Butanone)","78-93-3","1B",150,445,null,300,890,null,null,null,null,"Y",380,null,380,"Methyl ethyl ketone (MEK, 2-Butanone)","78-93-3","1B",150,445,null,300,890,null,null,null,null,"Y",380,null,"","","","","","","","","","","","","","",""]
[null,381,"Methyl ethyl ketone peroxide","1338-23-4","1A",null,null,null,null,null,null,0.2,1.5,null,"N",381,null,381,"Methyl ethyl ketone peroxide","1338-23-4","1A",null,null,null,null,null,null,0.2,1.5,null,"N",381,null,"","","","","","","","","","","","","","",""]
[null,382,"Methyl formate (Formic acid, methyl ester)","107-31-3","1B",100,246,null,150,368,null,null,null,null,"Y",382,null,382,"Methyl formate (Formic acid, methyl ester)","107-31-3","1B",100,246,null,150,368,null,null,null,null,"Y",382,null,"","","","","","","","","","","","","","",""]
[null,383,"Methyl hydrazine","60-34-4",4,0.01,1.9E-2,null,null,null,null,null,null,null,"Y",383,null,383,"Methyl hydrazine","60-34-4",4,0.01,1.9E-2,null,null,null,null,null,null,null,"Y",383,null,"","","","","","","","","","","","","","",""]
[null,384,"Methyl iodide (Iodomethane)","74-88-4",4,2,12,null,null,null,null,null,null,null,"Y",384,null,384,"Methyl iodide (Iodomethane)","74-88-4",4,2,12,null,null,null,null,null,null,null,"Y",384,null,"","","","","","","","","","","","","","",""]
[null,385,"Methyl isoamyl ketone (Isoamyl methyl ketone; 5-Methyl-2-hexanone)","110-12-3","1B",50,234,null,null,null,null,null,null,null,{"$f":"IF(COUNTA(F390:H390)=0,\"N\",\"Y\")","v":"Y"},{"$f":"B390","v":385},null,385,"Methyl isoamyl ketone (Isoamyl methyl ketone; 5-Methyl-2-hexanone)","110-12-3","1B",50,234,null,null,null,null,null,null,null,{"$f":"IF(COUNTA(V390:X390)=0,\"N\",\"Y\")","v":"Y"},{"$f":"R390","v":385},null,"","","","","","","","","","","","","","",""]
[null,386,"Methyl isobutyl carbinol (Methyl amyl alcohol)","108-11-2","1B",25,104,null,40,167,null,null,null,null,"Y",386,null,386,"Methyl isobutyl carbinol (Methyl amyl alcohol)","108-11-2","1B",25,104,null,40,167,null,null,null,null,"Y",386,null,{"$f":"IF(C391=S391,\"\",1)","v":""},{"$f":"IF(D391=T391,\"\",1)","v":""},{"$f":"IF(E391=U391,\"\",1)","v":""},{"$f":"IF(F391=V391,\"\",1)","v":""},{"$f":"IF(G391=W391,\"\",1)","v":""},{"$f":"IF(H391=X391,\"\",1)","v":""},{"$f":"IF(I391=Y391,\"\",1)","v":""},{"$f":"IF(J391=Z391,\"\",1)","v":""},{"$f":"IF(K391=AA391,\"\",1)","v":""},{"$f":"IF(L391=AB391,\"\",1)","v":""},{"$f":"IF(M391=AC391,\"\",1)","v":""},{"$f":"IF(N391=AD391,\"\",1)","v":""},{"$f":"IF(O391=AE391,\"\",1)","v":""},{"$f":"IF(P391=AF391,\"\",1)","v":""},{"$f":"IF(Q391=AG391,\"\",1)","v":""}]
[null,387,"Methyl isobutyl ketone (MIBK, Hexone, 4-Methyl-2-pentanone)","108-10-1","1B",50,205,null,75,307,null,null,null,null,"Y",387,null,387,"Methyl isobutyl ketone (MIBK, Hexone, 4-Methyl-2-pentanone)","108-10-1","1B",50,205,null,75,307,null,null,null,null,"Y",387,null,"","","","","","","","","","","","","","",""]
[null,388,"Methyl isocyanate","624-83-9",3,null,0.02,null,null,7.0000000000000007E-2,null,null,null,null,"Y",388,null,388,"Methyl isocyanate","624-83-9",3,null,0.02,null,null,7.0000000000000007E-2,null,null,null,null,"Y",388,null,"","","","","","","","","","","","","","",""]
[null,389,"Methyl isopropyl ketone (3-Methyl-2-butanone)","563-80-4","1B",200,705,null,null,null,null,null,null,null,"Y",389,null,389,"Methyl isopropyl ketone (3-Methyl-2-butanone)","563-80-4","1B",200,705,null,null,null,null,null,null,null,"Y",389,null,"","","","","","","","","","","","","","",""]
[null,390,"Methyl mercaptan (Methanethiol)","74-93-1","1B",0.5,0.98,null,null,null,null,null,null,null,"Y",390,null,390,"Methyl mercaptan (Methanethiol)","74-93-1","1B",0.5,0.98,null,null,null,null,null,null,null,"Y",390,null,"","","","","","","","","","","","","","",""]
[null,391,"Methyl methacrylate (Methacrylic acid, methyl ester)","80-62-6",4,50,208,null,100,416,null,null,null,null,"Y",391,null,391,"Methyl methacrylate (Methacrylic acid, methyl ester)","80-62-6",4,50,208,null,100,416,null,null,null,null,"Y",391,null,"","","","","","","","","","","","","","",""]
[null,392,"Methyl n-amyl ketone (2-Heptanone; Heptan-2-one)","110-43-0","1B",50,233,null,null,null,null,null,null,null,"Y",392,null,392,"Methyl n-amyl ketone (2-Heptanone; Heptan-2-one)","110-43-0","1B",50,233,null,null,null,null,null,null,null,"Y",392,null,"","","","","","","","","","","","","","",""]
[null,393,"Methyl n-butyl ketone (2-Hexanone)","591-78-6",3,5,20,null,null,null,null,null,null,null,"Y",393,null,393,"Methyl n-butyl ketone (2-Hexanone)","591-78-6",3,5,20,null,null,null,null,null,null,null,"Y",393,null,"","","","","","","","","","","","","","",""]
[null,394,"Methyl parathion","298-00-0",4,null,0.2,null,null,null,null,null,null,null,"Y",394,null,394,"Methyl parathion","298-00-0",4,null,0.2,null,null,null,null,null,null,null,"Y",394,null,"","","","","","","","","","","","","","",""]
[null,395,"Methyl propyl ketone (2-Pentanone)","107-87-9",2,200,705,null,250,881,null,null,null,null,"Y",395,null,395,"Methyl propyl ketone (2-Pentanone)","107-87-9",2,200,705,null,250,881,null,null,null,null,"Y",395,null,"","","","","","","","","","","","","","",""]
[null,396,"Methyl silicate (Tetramethyl orthosilicate)","681-84-5",2,1,6,null,null,null,null,null,null,null,"Y",396,null,396,"Methyl silicate (Tetramethyl orthosilicate)","681-84-5",2,1,6,null,null,null,null,null,null,null,"Y",396,null,"","","","","","","","","","","","","","",""]
[null,397,"alpha-Methyl styrene (2-Phenylpropene)","98-83-9",2,50,242,null,100,483,null,null,null,null,"Y",397,null,397,"alpha-Methyl styrene (2-Phenylpropene)","98-83-9",2,50,242,null,100,483,null,null,null,null,"Y",397,null,"","","","","","","","","","","","","","",""]
[null,398,"1-Methyl-2-pyrrolidone","872-50-4",4,25,103,null,75,309,null,null,null,null,"Y",398,null,398,"1-Methyl-2-pyrrolidone","872-50-4",4,25,103,null,75,309,null,null,null,null,"Y",398,null,"","","","","","","","","","","","","","",""]
[null,399,"Methylacrylonitrile","126-98-7",4,1,2.7,null,null,null,null,null,null,null,"Y",399,null,399,"Methylacrylonitrile","126-98-7",4,1,2.7,null,null,null,null,null,null,null,"Y",399,null,"","","","","","","","","","","","","","",""]
[null,400,"Methylal (Dimethoxymethane)","109-87-5","1B",1000,3110,null,null,null,null,null,null,null,"Y",400,null,400,"Methylal (Dimethoxymethane)","109-87-5","1B",1000,3110,null,null,null,null,null,null,null,"Y",400,null,"","","","","","","","","","","","","","",""]
[null,401,"Methylamine ","74-89-5","1B",10,13,null,null,null,null,null,null,null,"Y",401,null,401,"Methylamine ","74-89-5","1B",10,13,null,null,null,null,null,null,null,"Y",401,null,"","","","","","","","","","","","","","",""]
[null,402,"Methylcyclohexane","108-87-2","1B",400,1610,null,null,null,null,null,null,null,"Y",402,null,402,"Methylcyclohexane","108-87-2","1B",400,1610,null,null,null,null,null,null,null,"Y",402,null,"","","","","","","","","","","","","","",""]
[null,403,"Methylcyclohexanol","25639-42-3",3,50,234,null,null,null,null,null,null,null,"Y",403,null,403,"Methylcyclohexanol","25639-42-3",3,50,234,null,null,null,null,null,null,null,"Y",403,null,"","","","","","","","","","","","","","",""]
[null,404,"o-Methylcyclohexanone","583-60-8","1B",50,229,null,75,344,null,null,null,null,"Y",404,null,404,"o-Methylcyclohexanone","583-60-8","1B",50,229,null,75,344,null,null,null,null,"Y",404,null,"","","","","","","","","","","","","","",""]
[null,405,"Methylcyclopentadienyl manganese tricarbonyl (as Mn)","12108-13-3",4,null,0.2,null,null,null,null,null,null,null,"Y",405,null,405,"Methylcyclopentadienyl manganese tricarbonyl (as Mn)","12108-13-3",4,null,0.2,null,null,null,null,null,null,null,"Y",405,null,"","","","","","","","","","","","","","",""]
[null,406,"4,4’-Methylene bis (2-chloroaniline) (MOCA, MBOCA, 2,2'-Dichloro-4,4'-methylenedianiline)","101-14-4",4,0.02,0.22,null,null,null,null,null,null,null,"Y",406,null,406,"4,4’-Methylene bis (2-chloroaniline) (MOCA, MBOCA, 2,2'-Dichloro-4,4'-methylenedianiline)","101-14-4",4,0.02,0.22,null,null,null,null,null,null,null,"Y",406,null,"","","","","","","","","","","","","","",""]
[null,407,"Methylene bis (4-cyclo-hexylisocyanate)","5124-30-1",3,null,0.02,null,null,7.0000000000000007E-2,null,null,null,null,"Y",407,null,407,"Methylene bis (4-cyclo-hexylisocyanate)","5124-30-1",3,null,0.02,null,null,7.0000000000000007E-2,null,null,null,null,"Y",407,null,"","","","","","","","","","","","","","",""]
[null,408,"Methylene bisphenyl isocyanate (MDI, Diphenylmethane diisocyanate)","101-68-8",3,null,0.02,null,null,7.0000000000000007E-2,null,null,null,null,"Y",408,null,408,"Methylene bisphenyl isocyanate (MDI, Diphenylmethane diisocyanate)","101-68-8",3,null,0.02,null,null,7.0000000000000007E-2,null,null,null,null,"Y",408,null,"","","","","","","","","","","","","","",""]
[null,409,"Methylene chloride (Dichloromethane)","75-09-2",4,50,174,null,null,null,null,null,null,null,"Y",409,null,409,"Methylene chloride (Dichloromethane)","75-09-2",4,50,174,null,null,null,null,null,null,null,"Y",409,null,"","","","","","","","","","","","","","",""]
[null,410,"4,4'-Methylene dianiline (MDA, DADPM, DDM, p,p'-Diaminodiphenylmethane)","101-77-9",3,0.1,0.81,null,null,null,null,null,null,null,"Y",410,null,410,"4,4'-Methylene dianiline (MDA, DADPM, DDM, p,p'-Diaminodiphenylmethane)","101-77-9",3,0.1,0.81,null,null,null,null,null,null,null,"Y",410,null,"","","","","","","","","","","","","","",""]
[null,411,"5-Methylheptan-3-one (Ethyl amyl ketone)","541-85-5","1B",10,53,null,20,107,null,null,null,null,"Y",411,null,411,"5-Methylheptan-3-one (Ethyl amyl ketone)","541-85-5","1B",10,53,null,20,107,null,null,null,null,"Y",411,null,"","","","","","","","","","","","","","",""]
[null,412,"Methyl-tert butyl ether","1634-04-4",4,25,92,null,75,275,null,null,null,null,"Y",412,null,412,"Methyl-tert butyl ether","1634-04-4",4,25,92,null,75,275,null,null,null,null,"Y",412,null,"","","","","","","","","","","","","","",""]
[null,413,"Metribuzin (Sencor)","21087-64-9",2,null,5,null,null,null,null,null,null,null,"Y",413,null,413,"Metribuzin (Sencor)","21087-64-9",2,null,5,null,null,null,null,null,null,null,"Y",413,null,"","","","","","","","","","","","","","",""]
[null,414,"Mevinphos (Phosdrin)","7786-34-7",4,0.01,9.1999999999999998E-2,null,0.03,0.27,null,null,null,null,"Y",414,null,414,"Mevinphos (Phosdrin)","7786-34-7",4,0.01,9.1999999999999998E-2,null,0.03,0.27,null,null,null,null,"Y",414,null,"","","","","","","","","","","","","","",""]
[null,415,"Mica","12001-26-2",3,null,2.5,null,null,null,null,null,null,null,"Y",415,null,415,"Mica","12001-26-2",3,null,2.5,null,null,null,null,null,null,null,"Y",415,null,"","","","","","","","","","","","","","",""]
[null,416,"Mineral turpentine",null,4,null,480,null,null,null,null,null,null,null,"Y",416,null,416,"Mineral turpentine",null,4,null,480,null,null,null,null,null,null,null,"Y",416,null,"","","","","","","","","","","","","","",""]
[null,417,"Molybdenum, insoluble compounds (as Mo)","7439-98-7","1C",null,10,null,null,null,null,null,null,null,"Y",417,null,417,"Molybdenum, insoluble compounds (as Mo)","7439-98-7","1C",null,10,null,null,null,null,null,null,null,"Y",417,null,"","","","","","","","","","","","","","",""]
[null,418,"Molybdenum, soluble compounds (as Mo)","7439-98-7","1C",null,5,null,null,null,null,null,null,null,"Y",418,null,418,"Molybdenum, soluble compounds (as Mo)","7439-98-7","1C",null,5,null,null,null,null,null,null,null,"Y",418,null,"","","","","","","","","","","","","","",""]
[null,419,"Monochloroacetic acid","79-11-8","1B",0.3,1.2,null,null,null,null,null,null,null,"Y",419,null,419,"Monochloroacetic acid","79-11-8","1B",0.3,1.2,null,null,null,null,null,null,null,"Y",419,null,"","","","","","","","","","","","","","",""]
[null,420,"Monocrotophos (Azodrin)","6923-22-4",4,null,0.25,null,null,null,null,null,null,null,"Y",420,null,420,"Monocrotophos (Azodrin)","6923-22-4",4,null,0.25,null,null,null,null,null,null,null,"Y",420,null,"","","","","","","","","","","","","","",""]
[null,421,"Morpholine","110-91-8","1B",20,71,null,null,null,null,null,null,null,"Y",421,null,421,"Morpholine","110-91-8","1B",20,71,null,null,null,null,null,null,null,"Y",421,null,"","","","","","","","","","","","","","",""]
[null,422,"Naled (Dibrom; Dimethyl-1,2-dibromo-2,2-dichloroethylphosphate)","300-76-5",4,null,3,null,null,null,null,null,null,null,"Y",422,null,422,"Naled (Dibrom; Dimethyl-1,2-dibromo-2,2-dichloroethylphosphate)","300-76-5",4,null,3,null,null,null,null,null,null,null,"Y",422,null,"","","","","","","","","","","","","","",""]
[null,423,"Naphthalene","91-20-3",4,10,52,null,15,79,null,null,null,null,"Y",423,null,423,"Naphthalene","91-20-3",4,10,52,null,15,79,null,null,null,null,"Y",423,null,"","","","","","","","","","","","","","",""]
[null,424,"Nickel carbonyl (as Ni) (Tetracarbonyl nickel)","13463-39-3",2,0.05,0.12,null,null,null,null,null,null,null,"Y",424,null,424,"Nickel carbonyl (as Ni) (Tetracarbonyl nickel)","13463-39-3",2,0.05,0.12,null,null,null,null,null,null,null,"Y",424,null,"","","","","","","","","","","","","","",""]
[null,425,"Nickel dichloride","7718-54-9",3,null,0.1,null,null,null,null,null,null,null,"Y",425,null,425,"Nickel dichloride","7718-54-9",3,null,0.1,null,null,null,null,null,null,null,"Y",425,null,"","","","","","","","","","","","","","",""]
[null,426,"Nickel dinitrate","13138-45-9",3,null,0.1,null,null,null,null,null,null,null,"Y",426,null,426,"Nickel dinitrate","13138-45-9",3,null,0.1,null,null,null,null,null,null,null,"Y",426,null,"","","","","","","","","","","","","","",""]
[null,427,"Nickel, metal","7440-02-0",3,null,1,null,null,null,null,null,null,null,"Y",427,null,427,"Nickel, metal","7440-02-0",3,null,1,null,null,null,null,null,null,null,"Y",427,null,"","","","","","","","","","","","","","",""]
[null,428,"Nickel, powder","7440-02-0",3,null,1,null,null,null,null,null,null,null,"Y",428,null,428,"Nickel, powder","7440-02-0",3,null,1,null,null,null,null,null,null,null,"Y",428,null,"","","","","","","","","","","","","","",""]
[null,429,"Nickel salt, nitric acid","14216-75-2",3,null,0.1,null,null,null,null,null,null,null,"Y",429,null,429,"Nickel salt, nitric acid","14216-75-2",3,null,0.1,null,null,null,null,null,null,null,"Y",429,null,"","","","","","","","","","","","","","",""]
[null,430,"Nickel, soluble compounds (as Ni)","7440-02-0",3,null,0.1,null,null,null,null,null,null,null,"Y",430,null,430,"Nickel, soluble compounds (as Ni)","7440-02-0",3,null,0.1,null,null,null,null,null,null,null,"Y",430,null,"","","","","","","","","","","","","","",""]
[null,431,"Nickel sulphide roasting (fume & dust) (as Ni)",null,3,null,1,null,null,null,null,null,null,null,"Y",431,null,431,"Nickel sulphide roasting (fume & dust) (as Ni)",null,3,null,1,null,null,null,null,null,null,null,"Y",431,null,"","","","","","","","","","","","","","",""]
[null,432,"Nicotine","54-11-5",2,null,0.5,null,null,null,null,null,null,null,"Y",432,null,432,"Nicotine","54-11-5",2,null,0.5,null,null,null,null,null,null,null,"Y",432,null,"","","","","","","","","","","","","","",""]
[null,433,"Nitrapyrin (N-Serve; 2-Chloro-6-(trichloromethyl) pyridine)","1929-82-4","1C",null,10,null,null,20,null,null,null,null,"Y",433,null,433,"Nitrapyrin (N-Serve; 2-Chloro-6-(trichloromethyl) pyridine)","1929-82-4","1C",null,10,null,null,20,null,null,null,null,"Y",433,null,"","","","","","","","","","","","","","",""]
[null,434,"Nitric acid","7697-37-2",2,2,5.2,null,4,10,null,null,null,null,"Y",434,null,434,"Nitric acid","7697-37-2",2,2,5.2,null,4,10,null,null,null,null,"Y",434,null,"","","","","","","","","","","","","","",""]
[null,435,"Nitric oxide (Nitrogen monoxide)","10102-43-9",2,25,31,null,null,null,null,null,null,null,"Y",435,null,435,"Nitric oxide (Nitrogen monoxide)","10102-43-9",2,25,31,null,null,null,null,null,null,null,"Y",435,null,"","","","","","","","","","","","","","",""]
[null,436,"p-Nitroaniline","100-01-6",4,null,3,null,null,null,null,null,null,null,"Y",436,null,436,"p-Nitroaniline","100-01-6",4,null,3,null,null,null,null,null,null,null,"Y",436,null,"","","","","","","","","","","","","","",""]
[null,437,"Nitrobenzene","98-95-3",4,1,5,null,null,null,null,null,null,null,"Y",437,null,437,"Nitrobenzene","98-95-3",4,1,5,null,null,null,null,null,null,null,"Y",437,null,"","","","","","","","","","","","","","",""]
[null,438,"p-Nitrochlorobenzene (p-Chloronitrobenzene)","100-00-5",4,0.1,0.64,null,null,null,null,null,null,null,"Y",438,null,438,"p-Nitrochlorobenzene (p-Chloronitrobenzene)","100-00-5",4,0.1,0.64,null,null,null,null,null,null,null,"Y",438,null,"","","","","","","","","","","","","","",""]
[null,439,"Nitroethane","79-24-3","1B",100,307,null,null,null,null,null,null,null,"Y",439,null,439,"Nitroethane","79-24-3","1B",100,307,null,null,null,null,null,null,null,"Y",439,null,"","","","","","","","","","","","","","",""]
[null,440,"Nitrogen dioxide","10102-44-0",4,3,5.6,null,5,9.4,null,null,null,null,"Y",440,null,440,"Nitrogen dioxide","10102-44-0",4,3,5.6,null,5,9.4,null,null,null,null,"Y",440,null,"","","","","","","","","","","","","","",""]
[null,441,"Nitrogen trifluoride","7783-54-2",2,10,29,null,null,null,null,null,null,null,"Y",441,null,441,"Nitrogen trifluoride","7783-54-2",2,10,29,null,null,null,null,null,null,null,"Y",441,null,"","","","","","","","","","","","","","",""]
[null,442,"Nitroglycerin (NG, Glyceryl trinitrate)","55-63-0",2,0.05,0.46,null,null,null,null,null,null,null,"Y",442,null,442,"Nitroglycerin (NG, Glyceryl trinitrate)","55-63-0",2,0.05,0.46,null,null,null,null,null,null,null,"Y",442,null,"","","","","","","","","","","","","","",""]
[null,443,"Nitromethane","75-52-5",4,20,50,null,null,null,null,null,null,null,"Y",443,null,443,"Nitromethane","75-52-5",4,20,50,null,null,null,null,null,null,null,"Y",443,null,"","","","","","","","","","","","","","",""]
[null,444,"1-Nitropropane","108-03-2",3,25,91,null,null,null,null,null,null,null,"Y",444,null,444,"1-Nitropropane","108-03-2",3,25,91,null,null,null,null,null,null,null,"Y",444,null,"","","","","","","","","","","","","","",""]
[null,445,"2-Nitropropane","79-46-9",3,10,36,null,null,null,null,null,null,null,"Y",445,null,445,"2-Nitropropane","79-46-9",3,10,36,null,null,null,null,null,null,null,"Y",445,null,"","","","","","","","","","","","","","",""]
[null,446,"2-Nitrotoluene","88-72-2",4,2,11,null,null,null,null,null,null,null,"Y",446,null,446,"2-Nitrotoluene","88-72-2",4,2,11,null,null,null,null,null,null,null,"Y",446,null,"","","","","","","","","","","","","","",""]
[null,447,"3-Nitrotoluene","99-08-1",2,2,11,null,null,null,null,null,null,null,"Y",447,null,447,"3-Nitrotoluene","99-08-1",2,2,11,null,null,null,null,null,null,null,"Y",447,null,"","","","","","","","","","","","","","",""]
[null,448,"4-Nitrotoluene","99-99-0",2,2,11,null,null,null,null,null,null,null,"Y",448,null,448,"4-Nitrotoluene","99-99-0",2,2,11,null,null,null,null,null,null,null,"Y",448,null,"","","","","","","","","","","","","","",""]
[null,449,"Nitrous oxide (Dinitrogen monoxide, Laughing gas)","10024-97-2",3,25,45,null,null,null,null,null,null,null,{"$f":"IF(COUNTA(F454:H454)=0,\"N\",\"Y\")","v":"Y"},{"$f":"B454","v":449},null,449,"Nitrous oxide (Dinitrogen monoxide, Laughing gas)","10024-97-2",3,25,45,null,null,null,null,null,null,null,{"$f":"IF(COUNTA(V454:X454)=0,\"N\",\"Y\")","v":"Y"},{"$f":"R454","v":449},null,"","","","","","","","","","","","","","",""]
[null,450,"Nonane","111-84-2",2,200,1050,null,null,null,null,null,null,null,"Y",450,null,450,"Nonane","111-84-2",2,200,1050,null,null,null,null,null,null,null,"Y",450,null,{"$f":"IF(C455=S455,\"\",1)","v":""},{"$f":"IF(D455=T455,\"\",1)","v":""},{"$f":"IF(E455=U455,\"\",1)","v":""},{"$f":"IF(F455=V455,\"\",1)","v":""},{"$f":"IF(G455=W455,\"\",1)","v":""},{"$f":"IF(H455=X455,\"\",1)","v":""},{"$f":"IF(I455=Y455,\"\",1)","v":""},{"$f":"IF(J455=Z455,\"\",1)","v":""},{"$f":"IF(K455=AA455,\"\",1)","v":""},{"$f":"IF(L455=AB455,\"\",1)","v":""},{"$f":"IF(M455=AC455,\"\",1)","v":""},{"$f":"IF(N455=AD455,\"\",1)","v":""},{"$f":"IF(O455=AE455,\"\",1)","v":""},{"$f":"IF(P455=AF455,\"\",1)","v":""},{"$f":"IF(Q455=AG455,\"\",1)","v":""}]
[null,451,"Octachloronaphthalene","2234-13-1",3,null,0.1,null,null,0.3,null,null,null,null,"Y",451,null,451,"Octachloronaphthalene","2234-13-1",3,null,0.1,null,null,0.3,null,null,null,null,"Y",451,null,"","","","","","","","","","","","","","",""]
[null,452,"Octane","111-65-9",2,300,1400,null,375,1750,null,null,null,null,"Y",452,null,452,"Octane","111-65-9",2,300,1400,null,375,1750,null,null,null,null,"Y",452,null,"","","","","","","","","","","","","","",""]
[null,453,"Oil mist, refined mineral","8012-95-1",3,null,5,null,null,null,null,null,null,null,"Y",453,null,453,"Oil mist, refined mineral","8012-95-1",3,null,5,null,null,null,null,null,null,null,"Y",453,null,"","","","","","","","","","","","","","",""]
[null,454,"Osmium tetroxide (as Os)","20816-12-0","1B",2.0000000000000001E-4,1.6000000000000001E-3,null,5.9999999999999995E-4,4.7000000000000002E-3,null,null,null,null,"Y",454,null,454,"Osmium tetroxide (as Os)","20816-12-0","1B",2.0000000000000001E-4,1.6000000000000001E-3,null,5.9999999999999995E-4,4.7000000000000002E-3,null,null,null,null,"Y",454,null,"","","","","","","","","","","","","","",""]
[null,455,"Oxalic acid","144-62-7","1B",null,1,null,null,2,null,null,null,null,"Y",455,null,455,"Oxalic acid","144-62-7","1B",null,1,null,null,2,null,null,null,null,"Y",455,null,"","","","","","","","","","","","","","",""]
[null,456,"2,2'-Oxybis[ethanol] (Diethylene glycol)","111-46-6",2,23,100,null,null,null,null,null,null,null,"Y",456,null,456,"2,2'-Oxybis[ethanol] (Diethylene glycol)","111-46-6",2,23,100,null,null,null,null,null,null,null,"Y",456,null,"","","","","","","","","","","","","","",""]
[null,457,"Oxygen difluoride","7783-41-7","1A",null,null,null,null,null,null,0.05,0.11,null,"N",457,null,457,"Oxygen difluoride","7783-41-7","1A",null,null,null,null,null,null,0.05,0.11,null,"N",457,null,"","","","","","","","","","","","","","",""]
[null,458,"Ozone","10028-15-6","1A",null,null,null,null,null,null,0.1,0.2,null,"N",458,null,458,"Ozone","10028-15-6","1A",null,null,null,null,null,null,0.1,0.2,null,"N",458,null,"","","","","","","","","","","","","","",""]
[null,459,"Paraffin wax (fume)","8002-74-2","1B",null,2,null,null,null,null,null,null,null,"Y",459,null,459,"Paraffin wax (fume)","8002-74-2","1B",null,2,null,null,null,null,null,null,null,"Y",459,null,"","","","","","","","","","","","","","",""]
[null,460,"Paraquat (respirable sizes) (Paraquat dichloride (ISO))","4685-14-7",3,null,0.1,null,null,null,null,null,null,null,"Y",460,null,460,"Paraquat (respirable sizes) (Paraquat dichloride (ISO))","4685-14-7",3,null,0.1,null,null,null,null,null,null,null,"Y",460,null,"","","","","","","","","","","","","","",""]
[null,461,"Parathion","56-38-2",4,null,0.1,null,null,null,null,null,null,null,"Y",461,null,461,"Parathion","56-38-2",4,null,0.1,null,null,null,null,null,null,null,"Y",461,null,"","","","","","","","","","","","","","",""]
[null,462,"PCBs (42% Chlorine) (Polychlorinated biphenyls, Polychlorobiphenyls, Chlorobiphenyl)","53469-21-9",3,null,1,null,null,2,null,null,null,null,"Y",462,null,462,"PCBs (42% Chlorine) (Polychlorinated biphenyls, Polychlorobiphenyls, Chlorobiphenyl)","53469-21-9",3,null,1,null,null,2,null,null,null,null,"Y",462,null,"","","","","","","","","","","","","","",""]
[null,463,"PCBs (54% Chlorine) (Chlorobiphenyl)","11097-69-1",3,null,0.5,null,null,1,null,null,null,null,"Y",463,null,463,"PCBs (54% Chlorine) (Chlorobiphenyl)","11097-69-1",3,null,0.5,null,null,1,null,null,null,null,"Y",463,null,"","","","","","","","","","","","","","",""]
[null,464,"Pentaborane","19624-22-7",2,5.0000000000000001E-3,1.2999999999999999E-2,null,1.4999999999999999E-2,3.9E-2,null,null,null,null,"Y",464,null,464,"Pentaborane","19624-22-7",2,5.0000000000000001E-3,1.2999999999999999E-2,null,1.4999999999999999E-2,3.9E-2,null,null,null,null,"Y",464,null,"","","","","","","","","","","","","","",""]
[null,465,"Pentachloronaphthalene","1321-64-8",3,null,0.5,null,null,null,null,null,null,null,"Y",465,null,465,"Pentachloronaphthalene","1321-64-8",3,null,0.5,null,null,null,null,null,null,null,"Y",465,null,"","","","","","","","","","","","","","",""]
[null,466,"Pentachloronitrobenzene","82-68-8",3,null,0.5,null,null,null,null,null,null,null,"Y",466,null,466,"Pentachloronitrobenzene","82-68-8",3,null,0.5,null,null,null,null,null,null,null,"Y",466,null,"","","","","","","","","","","","","","",""]
[null,467,"Pentachlorophenol","87-86-5",4,null,0.5,null,null,null,null,null,null,null,"Y",467,null,467,"Pentachlorophenol","87-86-5",4,null,0.5,null,null,null,null,null,null,null,"Y",467,null,"","","","","","","","","","","","","","",""]
[null,468,"Pentaerythritol ","115-77-5","1C",null,10,null,null,null,null,null,null,null,"Y",468,null,468,"Pentaerythritol ","115-77-5","1C",null,10,null,null,null,null,null,null,null,"Y",468,null,"","","","","","","","","","","","","","",""]
[null,469,"Pentane","109-66-0",2,600,1770,null,750,2210,null,null,null,null,"Y",469,null,469,"Pentane","109-66-0",2,600,1770,null,750,2210,null,null,null,null,"Y",469,null,"","","","","","","","","","","","","","",""]
[null,470,"Perchloroethylene (Tetrachloroethylene)","127-18-4",4,50,340,null,150,1020,null,null,null,null,"Y",470,null,470,"Perchloroethylene (Tetrachloroethylene)","127-18-4",4,50,340,null,150,1020,null,null,null,null,"Y",470,null,"","","","","","","","","","","","","","",""]
[null,471,"Perchloromethyl mercaptan","594-42-3",2,0.1,0.76,null,null,null,null,null,null,null,"Y",471,null,471,"Perchloromethyl mercaptan","594-42-3",2,0.1,0.76,null,null,null,null,null,null,null,"Y",471,null,"","","","","","","","","","","","","","",""]
[null,472,"Perchloryl fluoride","7616-94-6",4,3,13,null,6,25,null,null,null,null,"Y",472,null,472,"Perchloryl fluoride","7616-94-6",4,3,13,null,6,25,null,null,null,null,"Y",472,null,"","","","","","","","","","","","","","",""]
[null,473,"Perfluoroisobutylene (Octafluoroisobutylene)","382-21-8","1A",null,null,null,null,null,null,0.01,8.2000000000000003E-2,null,"N",473,null,473,"Perfluoroisobutylene (Octafluoroisobutylene)","382-21-8","1A",null,null,null,null,null,null,0.01,8.2000000000000003E-2,null,"N",473,null,"","","","","","","","","","","","","","",""]
[null,474,"Perlite dust ","93763-70-3","1C",null,10,null,null,null,null,null,null,null,"Y",474,null,474,"Perlite dust ","93763-70-3","1C",null,10,null,null,null,null,null,null,null,"Y",474,null,"","","","","","","","","","","","","","",""]
[null,475,"Petrol (gasoline)",null,2,null,900,null,null,null,null,null,null,null,"Y",475,null,475,"Petrol (gasoline)",null,2,null,900,null,null,null,null,null,null,null,"Y",475,null,"","","","","","","","","","","","","","",""]
[null,476,"Phenol","108-95-2",4,1,4,null,null,null,null,null,null,null,"Y",476,null,476,"Phenol","108-95-2",4,1,4,null,null,null,null,null,null,null,"Y",476,null,"","","","","","","","","","","","","","",""]
[null,477,"Phenothiazine","92-84-2",3,null,5,null,null,null,null,null,null,null,"Y",477,null,477,"Phenothiazine","92-84-2",3,null,5,null,null,null,null,null,null,null,"Y",477,null,"","","","","","","","","","","","","","",""]
[null,478,"Phenyl ether (vapour) (Diphenyl ether)","101-84-8","1B",1,7,null,2,14,null,null,null,null,"Y",478,null,478,"Phenyl ether (vapour) (Diphenyl ether)","101-84-8","1B",1,7,null,2,14,null,null,null,null,"Y",478,null,"","","","","","","","","","","","","","",""]
[null,479,"Phenyl glycidyl ether (PGE; Phenyl-2,3-epoxypropyl ether)","122-60-1",3,1,6.1,null,null,null,null,null,null,null,"Y",479,null,479,"Phenyl glycidyl ether (PGE; Phenyl-2,3-epoxypropyl ether)","122-60-1",3,1,6.1,null,null,null,null,null,null,null,"Y",479,null,"","","","","","","","","","","","","","",""]
[null,480,"Phenyl mercaptan (Benzenethiol)","108-98-5","1B",0.5,2.2999999999999998,null,null,null,null,null,null,null,"Y",480,null,480,"Phenyl mercaptan (Benzenethiol)","108-98-5","1B",0.5,2.2999999999999998,null,null,null,null,null,null,null,"Y",480,null,"","","","","","","","","","","","","","",""]
[null,481,"m-Phenylenediamine (1,3-Benzenediamine)","108-45-2",3,null,0.1,null,null,null,null,null,null,null,"Y",481,null,481,"m-Phenylenediamine (1,3-Benzenediamine)","108-45-2",3,null,0.1,null,null,null,null,null,null,null,"Y",481,null,"","","","","","","","","","","","","","",""]
[null,482,"o-Phenylenediamine (1,2-Benzenediamine)","95-54-5",3,null,0.1,null,null,null,null,null,null,null,"Y",482,null,482,"o-Phenylenediamine (1,2-Benzenediamine)","95-54-5",3,null,0.1,null,null,null,null,null,null,null,"Y",482,null,"","","","","","","","","","","","","","",""]
[null,483,"p-Phenylenediamine (1,4-Benzenediamine)","106-50-3",3,null,0.1,null,null,null,null,null,null,null,"Y",483,null,483,"p-Phenylenediamine (1,4-Benzenediamine)","106-50-3",3,null,0.1,null,null,null,null,null,null,null,"Y",483,null,"","","","","","","","","","","","","","",""]
[null,484,"Phenylhydrazine","100-63-0",4,0.1,0.44,null,null,null,null,null,null,null,"Y",484,null,484,"Phenylhydrazine","100-63-0",4,0.1,0.44,null,null,null,null,null,null,null,"Y",484,null,"","","","","","","","","","","","","","",""]
[null,485,"Phenylphosphine","638-21-1","1A",null,null,null,null,null,null,0.05,0.23,null,"N",485,null,485,"Phenylphosphine","638-21-1","1A",null,null,null,null,null,null,0.05,0.23,null,"N",485,null,"","","","","","","","","","","","","","",""]
[null,486,"Phorate (Thimet)","298-02-2",4,null,0.05,null,null,0.2,null,null,null,null,"Y",486,null,486,"Phorate (Thimet)","298-02-2",4,null,0.05,null,null,0.2,null,null,null,null,"Y",486,null,"","","","","","","","","","","","","","",""]
[null,487,"Phosgene (Carbonyl chloride)","75-44-5",2,0.02,0.08,null,0.06,0.25,null,null,null,null,"Y",487,null,487,"Phosgene (Carbonyl chloride)","75-44-5",2,0.02,0.08,null,0.06,0.25,null,null,null,null,"Y",487,null,"","","","","","","","","","","","","","",""]
[null,488,"Phosphine","7803-51-2",2,0.3,0.42,null,1,1.4,null,null,null,null,"Y",488,null,488,"Phosphine","7803-51-2",2,0.3,0.42,null,1,1.4,null,null,null,null,"Y",488,null,"","","","","","","","","","","","","","",""]
[null,489,"Phosphoric acid (Orthophosphoric acid)","7664-38-2","1B",null,1,null,null,3,null,null,null,null,"Y",489,null,489,"Phosphoric acid (Orthophosphoric acid)","7664-38-2","1B",null,1,null,null,3,null,null,null,null,"Y",489,null,"","","","","","","","","","","","","","",""]
[null,490,"Phosphorus (yellow)","7723-14-0","1B",null,0.1,null,null,null,null,null,null,null,"Y",490,null,490,"Phosphorus (yellow)","7723-14-0","1B",null,0.1,null,null,null,null,null,null,null,"Y",490,null,"","","","","","","","","","","","","","",""]
[null,491,"Phosphorus oxychloride (Phosphoryl trichloride)","10025-87-3","1B",0.1,0.63,null,null,null,null,null,null,null,"Y",491,null,491,"Phosphorus oxychloride (Phosphoryl trichloride)","10025-87-3","1B",0.1,0.63,null,null,null,null,null,null,null,"Y",491,null,"","","","","","","","","","","","","","",""]
[null,492,"Phosphorus pentachloride","10026-13-8","1B",0.1,0.85,null,null,null,null,null,null,null,"Y",492,null,492,"Phosphorus pentachloride","10026-13-8","1B",0.1,0.85,null,null,null,null,null,null,null,"Y",492,null,"","","","","","","","","","","","","","",""]
[null,493,"Phosphorus pentasulphide (Diphosphorous pentasulphide)","1314-80-3","1B",null,1,null,null,3,null,null,null,null,"Y",493,null,493,"Phosphorus pentasulphide (Diphosphorous pentasulphide)","1314-80-3","1B",null,1,null,null,3,null,null,null,null,"Y",493,null,"","","","","","","","","","","","","","",""]
[null,494,"Phosphorus trichloride","7719-12-2","1B",0.2,1.1000000000000001,null,0.5,2.8,null,null,null,null,"Y",494,null,494,"Phosphorus trichloride","7719-12-2","1B",0.2,1.1000000000000001,null,0.5,2.8,null,null,null,null,"Y",494,null,"","","","","","","","","","","","","","",""]
[null,495,"Phthalic anhydride","85-44-9",3,1,6.1,null,null,null,null,null,null,null,"Y",495,null,495,"Phthalic anhydride","85-44-9",3,1,6.1,null,null,null,null,null,null,null,"Y",495,null,"","","","","","","","","","","","","","",""]
[null,496,"m-Phthalodinitrile","626-17-5","1C",null,5,null,null,null,null,null,null,null,"Y",496,null,496,"m-Phthalodinitrile","626-17-5","1C",null,5,null,null,null,null,null,null,null,"Y",496,null,"","","","","","","","","","","","","","",""]
[null,497,"Picloram (Tordon)","1918-02-1","1C",null,10,null,null,null,null,null,null,null,"Y",497,null,497,"Picloram (Tordon)","1918-02-1","1C",null,10,null,null,null,null,null,null,null,"Y",497,null,"","","","","","","","","","","","","","",""]
[null,498,"Picric acid (2,4,6-Trinitrophenol)","88-89-1",3,null,0.1,null,null,null,null,null,null,null,"Y",498,null,498,"Picric acid (2,4,6-Trinitrophenol)","88-89-1",3,null,0.1,null,null,null,null,null,null,null,"Y",498,null,"","","","","","","","","","","","","","",""]
[null,499,"Pindone (Pival; 2-Pivalyl-1,3-indandione)","83-26-1",3,null,0.1,null,null,null,null,null,null,null,"Y",499,null,499,"Pindone (Pival; 2-Pivalyl-1,3-indandione)","83-26-1",3,null,0.1,null,null,null,null,null,null,null,"Y",499,null,"","","","","","","","","","","","","","",""]
[null,500,"Piperazine dihydrochloride","142-64-3",3,null,5,null,null,null,null,null,null,null,"Y",500,null,500,"Piperazine dihydrochloride","142-64-3",3,null,5,null,null,null,null,null,null,null,"Y",500,null,"","","","","","","","","","","","","","",""]
[null,501,"Piperidine","110-89-4","1B",1,3.5,null,null,null,null,null,null,null,"Y",501,null,501,"Piperidine","110-89-4","1B",1,3.5,null,null,null,null,null,null,null,"Y",501,null,"","","","","","","","","","","","","","",""]
[null,502,"Platinum, metal","7440-06-4",3,null,1,null,null,null,null,null,null,null,"Y",502,null,502,"Platinum, metal","7440-06-4",3,null,1,null,null,null,null,null,null,null,"Y",502,null,"","","","","","","","","","","","","","",""]
[null,503,"Platinum, soluble salts (as Pt)",null,3,null,2E-3,null,null,null,null,null,null,null,"Y",503,null,503,"Platinum, soluble salts (as Pt)",null,3,null,2E-3,null,null,null,null,null,null,null,"Y",503,null,"","","","","","","","","","","","","","",""]
[null,504,"Portland cement ","65997-15-1","1B",null,10,null,null,null,null,null,null,null,"Y",504,null,504,"Portland cement ","65997-15-1","1B",null,10,null,null,null,null,null,null,null,"Y",504,null,"","","","","","","","","","","","","","",""]
[null,505,"Potassium hydroxide","1310-58-3","1A",null,null,null,null,null,null,null,2,null,"N",505,null,505,"Potassium hydroxide","1310-58-3","1A",null,null,null,null,null,null,null,2,null,"N",505,null,"","","","","","","","","","","","","","",""]
[null,506,"Potassium Persulfate","7727-21-1",2,null,null,null,null,null,null,null,0.01,null,"N",506,null,506,"Potassium Persulfate","7727-21-1",2,null,null,null,null,null,null,null,0.01,null,"N",506,null,"","","","","","","","","","","","","","",""]
[null,507,"Precipitated silica ","112926-00-8","1C",null,10,null,null,null,null,null,null,null,"Y",507,null,507,"Precipitated silica ","112926-00-8","1C",null,10,null,null,null,null,null,null,null,"Y",507,null,"","","","","","","","","","","","","","",""]
[null,508,"Propane-1,2-diol total: (vapour & particulates)","57-55-6",2,150,474,null,null,null,null,null,null,null,"Y",508,null,508,"Propane-1,2-diol total: (vapour & particulates)","57-55-6",2,150,474,null,null,null,null,null,null,null,"Y",508,null,"","","","","","","","","","","","","","",""]
[null,509,"Propane-1,2-diol: particulates only","57-55-6",2,null,10,null,null,null,null,null,null,null,"Y",509,null,509,"Propane-1,2-diol: particulates only","57-55-6",2,null,10,null,null,null,null,null,null,null,"Y",509,null,"","","","","","","","","","","","","","",""]
[null,510,"Propargyl alcohol (Prop-2-yn-1-ol)","107-19-7","1B",1,2.2999999999999998,null,null,null,null,null,null,null,"Y",510,null,510,"Propargyl alcohol (Prop-2-yn-1-ol)","107-19-7","1B",1,2.2999999999999998,null,null,null,null,null,null,null,"Y",510,null,"","","","","","","","","","","","","","",""]
[null,511,"beta-Propiolactone","57-57-8",4,0.5,1.5,null,null,null,null,null,null,null,"Y",511,null,511,"beta-Propiolactone","57-57-8",4,0.5,1.5,null,null,null,null,null,null,null,"Y",511,null,"","","","","","","","","","","","","","",""]
[null,512,"Propionic acid","79-09-4","1B",10,30,null,null,null,null,null,null,null,"Y",512,null,512,"Propionic acid","79-09-4","1B",10,30,null,null,null,null,null,null,null,"Y",512,null,"","","","","","","","","","","","","","",""]
[null,513,"Propoxur (PHC, Baygon, Arprocarb)","114-26-1",4,null,0.5,null,null,null,null,null,null,null,{"$f":"IF(COUNTA(F518:H518)=0,\"N\",\"Y\")","v":"Y"},{"$f":"B518","v":513},null,513,"Propoxur (PHC, Baygon, Arprocarb)","114-26-1",4,null,0.5,null,null,null,null,null,null,null,{"$f":"IF(COUNTA(V518:X518)=0,\"N\",\"Y\")","v":"Y"},{"$f":"R518","v":513},null,"","","","","","","","","","","","","","",""]
[null,514,"Propranolol","525-66-6",2,0.188,2,null,0.56499999999999995,6,null,null,null,null,"Y",514,null,514,"Propranolol","525-66-6",2,0.188,2,null,0.56499999999999995,6,null,null,null,null,"Y",514,null,{"$f":"IF(C519=S519,\"\",1)","v":""},{"$f":"IF(D519=T519,\"\",1)","v":""},{"$f":"IF(E519=U519,\"\",1)","v":""},{"$f":"IF(F519=V519,\"\",1)","v":""},{"$f":"IF(G519=W519,\"\",1)","v":""},{"$f":"IF(H519=X519,\"\",1)","v":""},{"$f":"IF(I519=Y519,\"\",1)","v":""},{"$f":"IF(J519=Z519,\"\",1)","v":""},{"$f":"IF(K519=AA519,\"\",1)","v":""},{"$f":"IF(L519=AB519,\"\",1)","v":""},{"$f":"IF(M519=AC519,\"\",1)","v":""},{"$f":"IF(N519=AD519,\"\",1)","v":""},{"$f":"IF(O519=AE519,\"\",1)","v":""},{"$f":"IF(P519=AF519,\"\",1)","v":""},{"$f":"IF(Q519=AG519,\"\",1)","v":""}]
[null,515,"n-Propyl acetate","109-60-4","1B",200,835,null,250,1040,null,null,null,null,"Y",515,null,515,"n-Propyl acetate","109-60-4","1B",200,835,null,250,1040,null,null,null,null,"Y",515,null,"","","","","","","","","","","","","","",""]
[null,516,"Propyl alcohol (Propan-1-ol)","71-23-8","1B",200,492,null,250,614,null,null,null,null,"Y",516,null,516,"Propyl alcohol (Propan-1-ol)","71-23-8","1B",200,492,null,250,614,null,null,null,null,"Y",516,null,"","","","","","","","","","","","","","",""]
[null,517,"n-Propyl nitrate","627-13-4",2,25,107,null,40,172,null,null,null,null,"Y",517,null,517,"n-Propyl nitrate","627-13-4",2,25,107,null,40,172,null,null,null,null,"Y",517,null,"","","","","","","","","","","","","","",""]
[null,518,"Propylene dichloride (1,2-Dichloropropane)","78-87-5",4,75,347,null,110,508,null,null,null,null,"Y",518,null,518,"Propylene dichloride (1,2-Dichloropropane)","78-87-5",4,75,347,null,110,508,null,null,null,null,"Y",518,null,"","","","","","","","","","","","","","",""]
[null,519,"Propylene glycol dinitrate","6423-43-4",4,0.05,0.34,null,null,null,null,null,null,null,"Y",519,null,519,"Propylene glycol dinitrate","6423-43-4",4,0.05,0.34,null,null,null,null,null,null,null,"Y",519,null,"","","","","","","","","","","","","","",""]
[null,520,"Propylene glycol monomethyl ether (1-Methoxypropan-2-ol)","107-98-2",4,100,369,null,150,553,null,null,null,null,"Y",520,null,520,"Propylene glycol monomethyl ether (1-Methoxypropan-2-ol)","107-98-2",4,100,369,null,150,553,null,null,null,null,"Y",520,null,"","","","","","","","","","","","","","",""]
[null,521,"Propylene imine","75-55-8",3,2,4.7,null,null,null,null,null,null,null,"Y",521,null,521,"Propylene imine","75-55-8",3,2,4.7,null,null,null,null,null,null,null,"Y",521,null,"","","","","","","","","","","","","","",""]
[null,522,"Propylene oxide (1,2-Epoxypropane)","75-56-9",4,20,48,null,null,null,null,null,null,null,"Y",522,null,522,"Propylene oxide (1,2-Epoxypropane)","75-56-9",4,20,48,null,null,null,null,null,null,null,"Y",522,null,"","","","","","","","","","","","","","",""]
[null,523,"Pyrethrum (Pyrethrins (ISO))","8003-34-7",3,null,5,null,null,null,null,null,null,null,"Y",523,null,523,"Pyrethrum (Pyrethrins (ISO))","8003-34-7",3,null,5,null,null,null,null,null,null,null,"Y",523,null,"","","","","","","","","","","","","","",""]
[null,524,"Pyridine","110-86-1",3,5,16,null,null,null,null,null,null,null,"Y",524,null,524,"Pyridine","110-86-1",3,5,16,null,null,null,null,null,null,null,"Y",524,null,"","","","","","","","","","","","","","",""]
[null,525,"Quartz (respirable dust)","14808-60-7",3,null,0.1,null,null,null,null,null,null,null,"Y",525,null,525,"Quartz (respirable dust)","14808-60-7",3,null,0.1,null,null,null,null,null,null,null,"Y",525,null,"","","","","","","","","","","","","","",""]
[null,526,"Quinone (p-Benzoquinone)","106-51-4","1B",0.1,0.44,null,null,null,null,null,null,null,"Y",526,null,526,"Quinone (p-Benzoquinone)","106-51-4","1B",0.1,0.44,null,null,null,null,null,null,null,"Y",526,null,"","","","","","","","","","","","","","",""]
[null,527,"Resorcinol (m-Dihydroxybenzene)","108-46-3",2,10,45,null,20,90,null,null,null,null,"Y",527,null,527,"Resorcinol (m-Dihydroxybenzene)","108-46-3",2,10,45,null,20,90,null,null,null,null,"Y",527,null,"","","","","","","","","","","","","","",""]
[null,528,"Rhodium, insoluble compounds (as Rh)","7440-16-6","1B",null,1,null,null,null,null,null,null,null,"Y",528,null,528,"Rhodium, insoluble compounds (as Rh)","7440-16-6","1B",null,1,null,null,null,null,null,null,null,"Y",528,null,"","","","","","","","","","","","","","",""]
[null,529,"Rhodium, metal","7440-16-6","1B",null,1,null,null,null,null,null,null,null,"Y",529,null,529,"Rhodium, metal","7440-16-6","1B",null,1,null,null,null,null,null,null,null,"Y",529,null,"","","","","","","","","","","","","","",""]
[null,530,"Rhodium, soluble compounds (as Rh)","7440-16-6",3,null,0.01,null,null,null,null,null,null,null,"Y",530,null,530,"Rhodium, soluble compounds (as Rh)","7440-16-6",3,null,0.01,null,null,null,null,null,null,null,"Y",530,null,"","","","","","","","","","","","","","",""]
[null,531,"Ronnel (Fenchlorphos)","299-84-3",4,null,10,null,null,null,null,null,null,null,"Y",531,null,531,"Ronnel (Fenchlorphos)","299-84-3",4,null,10,null,null,null,null,null,null,null,"Y",531,null,"","","","","","","","","","","","","","",""]
[null,532,"Rosin core solder pyrolysis products (as formaldehyde)",null,3,null,0.1,null,null,null,null,null,null,null,"Y",532,null,532,"Rosin core solder pyrolysis products (as formaldehyde)",null,3,null,0.1,null,null,null,null,null,null,null,"Y",532,null,"","","","","","","","","","","","","","",""]
[null,533,"Rotenone (commercial)","83-79-4",4,null,5,null,null,null,null,null,null,null,"Y",533,null,533,"Rotenone (commercial)","83-79-4",4,null,5,null,null,null,null,null,null,null,"Y",533,null,"","","","","","","","","","","","","","",""]
[null,534,"Rouge dust ",null,"1C",null,10,null,null,null,null,null,null,null,"Y",534,null,534,"Rouge dust ",null,"1C",null,10,null,null,null,null,null,null,null,"Y",534,null,"","","","","","","","","","","","","","",""]
[null,535,"Selenium compounds (as Se) excluding hydrogen selenide","7782-49-2",4,null,0.1,null,null,null,null,null,null,null,"Y",535,null,535,"Selenium compounds (as Se) excluding hydrogen selenide","7782-49-2",4,null,0.1,null,null,null,null,null,null,null,"Y",535,null,"","","","","","","","","","","","","","",""]
[null,536,"Selenium hexafluoride (as Se)","7783-79-1",4,0.05,0.16,null,null,null,null,null,null,null,"Y",536,null,536,"Selenium hexafluoride (as Se)","7783-79-1",4,0.05,0.16,null,null,null,null,null,null,null,"Y",536,null,"","","","","","","","","","","","","","",""]
[null,537,"Sesone (2,4-DES sodium; Crag Herbicide; Sodium 2,4-dichloro phenoxyethyl sulfate)","136-78-7",3,null,10,null,null,null,null,null,null,null,"Y",537,null,537,"Sesone (2,4-DES sodium; Crag Herbicide; Sodium 2,4-dichloro phenoxyethyl sulfate)","136-78-7",3,null,10,null,null,null,null,null,null,null,"Y",537,null,"","","","","","","","","","","","","","",""]
[null,538,"Silica – Amorphous - Fume (thermally generated)(respirable dust)",null,3,null,2,null,null,null,null,null,null,null,"Y",538,null,538,"Silica – Amorphous - Fume (thermally generated)(respirable dust)",null,3,null,2,null,null,null,null,null,null,null,"Y",538,null,"","","","","","","","","","","","","","",""]
[null,539,"Silica – Crystalline (respirable dust)",null,3,null,0.1,null,null,null,null,null,null,null,"Y",539,null,539,"Silica – Crystalline (respirable dust)",null,3,null,0.1,null,null,null,null,null,null,null,"Y",539,null,"","","","","","","","","","","","","","",""]
[null,540,"Silica gel ","112926-00-8","1C",null,10,null,null,null,null,null,null,null,"Y",540,null,540,"Silica gel ","112926-00-8","1C",null,10,null,null,null,null,null,null,null,"Y",540,null,"","","","","","","","","","","","","","",""]
[null,541,"Silica, fused","60676-86-0",3,null,0.1,null,null,null,null,null,null,null,"Y",541,null,541,"Silica, fused","60676-86-0",3,null,0.1,null,null,null,null,null,null,null,"Y",541,null,"","","","","","","","","","","","","","",""]
[null,542,"Silicon ","7440-21-3","1C",null,10,null,null,null,null,null,null,null,"Y",542,null,542,"Silicon ","7440-21-3","1C",null,10,null,null,null,null,null,null,null,"Y",542,null,"","","","","","","","","","","","","","",""]
[null,543,"Silicon carbide ","409-21-2","1C",null,10,null,null,null,null,null,null,null,"Y",543,null,543,"Silicon carbide ","409-21-2","1C",null,10,null,null,null,null,null,null,null,"Y",543,null,"","","","","","","","","","","","","","",""]
[null,544,"Silicon tetrahydride (Silane)","7803-62-5",2,5,6.6,null,null,null,null,null,null,null,"Y",544,null,544,"Silicon tetrahydride (Silane)","7803-62-5",2,5,6.6,null,null,null,null,null,null,null,"Y",544,null,"","","","","","","","","","","","","","",""]
[null,545,"Silver, metal","7440-22-4",3,null,0.1,null,null,null,null,null,null,null,"Y",545,null,545,"Silver, metal","7440-22-4",3,null,0.1,null,null,null,null,null,null,null,"Y",545,null,"","","","","","","","","","","","","","",""]
[null,546,"Silver, soluble compounds (as Ag)","7440-22-4",3,null,0.01,null,null,null,null,null,null,null,"Y",546,null,546,"Silver, soluble compounds (as Ag)","7440-22-4",3,null,0.01,null,null,null,null,null,null,null,"Y",546,null,"","","","","","","","","","","","","","",""]
[null,547,"Soapstone ","14378-12-2",3,null,6,null,null,null,null,null,null,null,"Y",547,null,547,"Soapstone ","14378-12-2",3,null,6,null,null,null,null,null,null,null,"Y",547,null,"","","","","","","","","","","","","","",""]
[null,548,"Soapstone (respirable dust)","14378-12-2",3,null,3,null,null,null,null,null,null,null,"Y",548,null,548,"Soapstone (respirable dust)","14378-12-2",3,null,3,null,null,null,null,null,null,null,"Y",548,null,"","","","","","","","","","","","","","",""]
[null,549,"Sodium azide ","26628-22-8","1A",null,null,null,null,null,null,0.11,0.3,null,"N",549,null,549,"Sodium azide ","26628-22-8","1A",null,null,null,null,null,null,0.11,0.3,null,"N",549,null,"","","","","","","","","","","","","","",""]
[null,550,"Sodium bisulphite (Sodium hydrogen sulphite)","7631-90-5","1B",null,5,null,null,null,null,null,null,null,"Y",550,null,550,"Sodium bisulphite (Sodium hydrogen sulphite)","7631-90-5","1B",null,5,null,null,null,null,null,null,null,"Y",550,null,"","","","","","","","","","","","","","",""]
[null,551,"Sodium fluoroacetate","62-74-8",2,null,0.05,null,null,0.15,null,null,null,null,"Y",551,null,551,"Sodium fluoroacetate","62-74-8",2,null,0.05,null,null,0.15,null,null,null,null,"Y",551,null,"","","","","","","","","","","","","","",""]
[null,552,"Sodium hydroxide","1310-73-2","1A",null,null,null,null,null,null,null,2,null,"N",552,null,552,"Sodium hydroxide","1310-73-2","1A",null,null,null,null,null,null,null,2,null,"N",552,null,"","","","","","","","","","","","","","",""]
[null,553,"Sodium metabisulphite (Disodium disulphite)","7681-57-4","1B",null,5,null,null,null,null,null,null,null,"Y",553,null,553,"Sodium metabisulphite (Disodium disulphite)","7681-57-4","1B",null,5,null,null,null,null,null,null,null,"Y",553,null,"","","","","","","","","","","","","","",""]
[null,554,"Sodium persulfate","7775-27-1",2,null,null,null,null,null,null,null,0.01,null,"N",554,null,554,"Sodium persulfate","7775-27-1",2,null,null,null,null,null,null,null,0.01,null,"N",554,null,"","","","","","","","","","","","","","",""]
[null,555,"Starch ","9005-25-8",3,null,10,null,null,null,null,null,null,null,"Y",555,null,555,"Starch ","9005-25-8",3,null,10,null,null,null,null,null,null,null,"Y",555,null,"","","","","","","","","","","","","","",""]
[null,556,"Stearates ",null,"1C",null,10,null,null,null,null,null,null,null,"Y",556,null,556,"Stearates ",null,"1C",null,10,null,null,null,null,null,null,null,"Y",556,null,"","","","","","","","","","","","","","",""]
[null,557,"Stibine (Antimony hydride)","7803-52-3",4,0.1,0.51,null,null,null,null,null,null,null,"Y",557,null,557,"Stibine (Antimony hydride)","7803-52-3",4,0.1,0.51,null,null,null,null,null,null,null,"Y",557,null,"","","","","","","","","","","","","","",""]
[null,558,"Strychnine","57-24-9",2,null,0.15,null,null,null,null,null,null,null,"Y",558,null,558,"Strychnine","57-24-9",2,null,0.15,null,null,null,null,null,null,null,"Y",558,null,"","","","","","","","","","","","","","",""]
[null,559,"Styrene, monomer (Phenylethylene, Vinyl benzene)","100-42-5",4,50,213,null,100,426,null,null,null,null,"Y",559,null,559,"Styrene, monomer (Phenylethylene, Vinyl benzene)","100-42-5",4,50,213,null,100,426,null,null,null,null,"Y",559,null,"","","","","","","","","","","","","","",""]
[null,560,"Subtilisins (Proteolytic enzymes as 100% pure crystalline enzyme)","1395-21-7",4,null,null,null,null,null,null,null,6.0000000000000002E-5,null,"N",560,null,560,"Subtilisins (Proteolytic enzymes as 100% pure crystalline enzyme)","1395-21-7",4,null,null,null,null,null,null,null,6.0000000000000002E-5,null,"N",560,null,"","","","","","","","","","","","","","",""]
[null,561,"Sucrose ","57-50-1","1C",null,10,null,null,null,null,null,null,null,"Y",561,null,561,"Sucrose ","57-50-1","1C",null,10,null,null,null,null,null,null,null,"Y",561,null,"","","","","","","","","","","","","","",""]
[null,562,"Sulfotep (TEDP; O,O,O,O-Tetraethyl dithiopyrophosphate)","3689-24-5",4,7.0000000000000001E-3,0.1,null,null,null,null,null,null,null,"Y",562,null,562,"Sulfotep (TEDP; O,O,O,O-Tetraethyl dithiopyrophosphate)","3689-24-5",4,7.0000000000000001E-3,0.1,null,null,null,null,null,null,null,"Y",562,null,"","","","","","","","","","","","","","",""]
[null,563,"Sulphur dioxide","7446-09-5","1B",2,5.2,null,5,13,null,null,null,null,"Y",563,null,563,"Sulphur dioxide","7446-09-5","1B",2,5.2,null,5,13,null,null,null,null,"Y",563,null,"","","","","","","","","","","","","","",""]
[null,564,"Sulphur hexafluoride","2551-62-4","1C",1000,5970,null,null,null,null,null,null,null,"Y",564,null,564,"Sulphur hexafluoride","2551-62-4","1C",1000,5970,null,null,null,null,null,null,null,"Y",564,null,"","","","","","","","","","","","","","",""]
[null,565,"Sulphur monochloride (Disulphur dichloride)","10025-67-9","1A",null,null,null,null,null,null,1,5.5,null,"N",565,null,565,"Sulphur monochloride (Disulphur dichloride)","10025-67-9","1A",null,null,null,null,null,null,1,5.5,null,"N",565,null,"","","","","","","","","","","","","","",""]
[null,566,"Sulphur pentafluoride (Disulphur decafluoride)","5714-22-7","1A",null,null,null,null,null,null,0.01,0.1,null,"N",566,null,566,"Sulphur pentafluoride (Disulphur decafluoride)","5714-22-7","1A",null,null,null,null,null,null,0.01,0.1,null,"N",566,null,"","","","","","","","","","","","","","",""]
[null,567,"Sulphur tetrafluoride","7783-60-0","1A",null,null,null,null,null,null,0.1,0.44,null,"N",567,null,567,"Sulphur tetrafluoride","7783-60-0","1A",null,null,null,null,null,null,0.1,0.44,null,"N",567,null,"","","","","","","","","","","","","","",""]
[null,568,"Sulphuric acid","7664-93-9","1B",null,1,null,null,3,null,null,null,null,"Y",568,null,568,"Sulphuric acid","7664-93-9","1B",null,1,null,null,3,null,null,null,null,"Y",568,null,"","","","","","","","","","","","","","",""]
[null,569,"Sulphuryl fluoride","2699-79-8",3,5,21,null,10,42,null,null,null,null,"Y",569,null,569,"Sulphuryl fluoride","2699-79-8",3,5,21,null,10,42,null,null,null,null,"Y",569,null,"","","","","","","","","","","","","","",""]
[null,570,"Sulprofos (Bolstar)","35400-43-2",4,null,1,null,null,null,null,null,null,null,"Y",570,null,570,"Sulprofos (Bolstar)","35400-43-2",4,null,1,null,null,null,null,null,null,null,"Y",570,null,"","","","","","","","","","","","","","",""]
[null,571,"2,4,5-T (2,4,5-Trichlorophenoxyacetic acid)","93-76-5","1C",null,10,null,null,null,null,null,null,null,"Y",571,null,571,"2,4,5-T (2,4,5-Trichlorophenoxyacetic acid)","93-76-5","1C",null,10,null,null,null,null,null,null,null,"Y",571,null,"","","","","","","","","","","","","","",""]
[null,572,"Talc (containing no asbestos fibres)","14807-96-6",3,null,2.5,null,null,null,null,null,null,null,"Y",572,null,572,"Talc (containing no asbestos fibres)","14807-96-6",3,null,2.5,null,null,null,null,null,null,null,"Y",572,null,"","","","","","","","","","","","","","",""]
[null,573,"Tantalum, metal & oxide dusts","7440-25-7","1C",null,5,null,null,null,null,null,null,null,"Y",573,null,573,"Tantalum, metal & oxide dusts","7440-25-7","1C",null,5,null,null,null,null,null,null,null,"Y",573,null,"","","","","","","","","","","","","","",""]
[null,574,"Tellurium & compounds (as Te)","13494-80-9",4,null,0.1,null,null,null,null,null,null,null,"Y",574,null,574,"Tellurium & compounds (as Te)","13494-80-9",4,null,0.1,null,null,null,null,null,null,null,"Y",574,null,"","","","","","","","","","","","","","",""]
[null,575,"Tellurium hexafluoride (as Te)","7783-80-4",2,0.02,0.1,null,null,null,null,null,null,null,"Y",575,null,575,"Tellurium hexafluoride (as Te)","7783-80-4",2,0.02,0.1,null,null,null,null,null,null,null,"Y",575,null,"","","","","","","","","","","","","","",""]
[null,576,"Temephos (Abate)","3383-96-8",4,null,10,null,null,null,null,null,null,null,"Y",576,null,576,"Temephos (Abate)","3383-96-8",4,null,10,null,null,null,null,null,null,null,"Y",576,null,"","","","","","","","","","","","","","",""]
[null,577,"TEPP (Tetraethyl pyrophosphate)","107-49-3",4,4.0000000000000001E-3,4.7E-2,null,null,null,null,null,null,null,{"$f":"IF(COUNTA(F582:H582)=0,\"N\",\"Y\")","v":"Y"},{"$f":"B582","v":577},null,577,"TEPP (Tetraethyl pyrophosphate)","107-49-3",4,4.0000000000000001E-3,4.7E-2,null,null,null,null,null,null,null,{"$f":"IF(COUNTA(V582:X582)=0,\"N\",\"Y\")","v":"Y"},{"$f":"R582","v":577},null,"","","","","","","","","","","","","","",""]
[null,578,"Terphenyls","26140-60-3","1A",null,null,null,null,null,null,0.5,4.7,null,"N",578,null,578,"Terphenyls","26140-60-3","1A",null,null,null,null,null,null,0.5,4.7,null,"N",578,null,{"$f":"IF(C583=S583,\"\",1)","v":""},{"$f":"IF(D583=T583,\"\",1)","v":""},{"$f":"IF(E583=U583,\"\",1)","v":""},{"$f":"IF(F583=V583,\"\",1)","v":""},{"$f":"IF(G583=W583,\"\",1)","v":""},{"$f":"IF(H583=X583,\"\",1)","v":""},{"$f":"IF(I583=Y583,\"\",1)","v":""},{"$f":"IF(J583=Z583,\"\",1)","v":""},{"$f":"IF(K583=AA583,\"\",1)","v":""},{"$f":"IF(L583=AB583,\"\",1)","v":""},{"$f":"IF(M583=AC583,\"\",1)","v":""},{"$f":"IF(N583=AD583,\"\",1)","v":""},{"$f":"IF(O583=AE583,\"\",1)","v":""},{"$f":"IF(P583=AF583,\"\",1)","v":""},{"$f":"IF(Q583=AG583,\"\",1)","v":""}]
[null,579,"1,1,2,2-Tetrabromoethane (Acetylene tetrabromide)","79-27-6",4,1,14,null,null,null,null,null,null,null,"Y",579,null,579,"1,1,2,2-Tetrabromoethane (Acetylene tetrabromide)","79-27-6",4,1,14,null,null,null,null,null,null,null,"Y",579,null,"","","","","","","","","","","","","","",""]
[null,580,"1,1,2,2-Tetrachloro-1,2-difluoroethane","76-12-0",4,500,4170,null,null,null,null,null,null,null,"Y",580,null,580,"1,1,2,2-Tetrachloro-1,2-difluoroethane","76-12-0",4,500,4170,null,null,null,null,null,null,null,"Y",580,null,"","","","","","","","","","","","","","",""]
[null,581,"1,1,1,2-Tetrachloro-2,2-difluoroethane","76-11-9",4,500,4170,null,null,null,null,null,null,null,"Y",581,null,581,"1,1,1,2-Tetrachloro-2,2-difluoroethane","76-11-9",4,500,4170,null,null,null,null,null,null,null,"Y",581,null,"","","","","","","","","","","","","","",""]
[null,582,"1,1,2,2-Tetrachloroethane","79-34-5",4,1,6.9,null,null,null,null,null,null,null,"Y",582,null,582,"1,1,2,2-Tetrachloroethane","79-34-5",4,1,6.9,null,null,null,null,null,null,null,"Y",582,null,"","","","","","","","","","","","","","",""]
[null,583,"Tetrachloronaphthalene","1335-88-2",3,null,2,null,null,null,null,null,null,null,"Y",583,null,583,"Tetrachloronaphthalene","1335-88-2",3,null,2,null,null,null,null,null,null,null,"Y",583,null,"","","","","","","","","","","","","","",""]
[null,584,"Tetraethyl lead (as Pb)","78-00-2",2,null,0.1,null,null,null,null,null,null,null,"Y",584,null,584,"Tetraethyl lead (as Pb)","78-00-2",2,null,0.1,null,null,null,null,null,null,null,"Y",584,null,"","","","","","","","","","","","","","",""]
[null,585,"1,1,1,2-Tetrafluoroethane (HFC 134a)","811-97-2","1C",1000,4240,null,null,null,null,null,null,null,"Y",585,null,585,"1,1,1,2-Tetrafluoroethane (HFC 134a)","811-97-2","1C",1000,4240,null,null,null,null,null,null,null,"Y",585,null,"","","","","","","","","","","","","","",""]
[null,586,"Tetrahydrofuran","109-99-9",4,100,295,null,null,null,null,null,null,null,"Y",586,null,586,"Tetrahydrofuran","109-99-9",4,100,295,null,null,null,null,null,null,null,"Y",586,null,"","","","","","","","","","","","","","",""]
[null,587,"Tetramethyl lead (as Pb)","75-74-1",3,null,0.15,null,null,null,null,null,null,null,"Y",587,null,587,"Tetramethyl lead (as Pb)","75-74-1",3,null,0.15,null,null,null,null,null,null,null,"Y",587,null,"","","","","","","","","","","","","","",""]
[null,588,"Tetramethyl succinonitrile","3333-52-6",2,0.5,2.8,null,null,null,null,null,null,null,"Y",588,null,588,"Tetramethyl succinonitrile","3333-52-6",2,0.5,2.8,null,null,null,null,null,null,null,"Y",588,null,"","","","","","","","","","","","","","",""]
[null,589,"Tetranitromethane ","509-14-8",4,1,8,null,null,null,null,null,null,null,"Y",589,null,589,"Tetranitromethane ","509-14-8",4,1,8,null,null,null,null,null,null,null,"Y",589,null,"","","","","","","","","","","","","","",""]
[null,590,"Tetrasodium pyrophosphate","7722-88-5","1B",null,5,null,null,null,null,null,null,null,"Y",590,null,590,"Tetrasodium pyrophosphate","7722-88-5","1B",null,5,null,null,null,null,null,null,null,"Y",590,null,"","","","","","","","","","","","","","",""]
[null,591,"Tetryl (2,4,6-Trinitrophenylmethylnitramine; N-Methyl-N-2,4,6-tetranitroaniline)","479-45-8",3,null,1.5,null,null,null,null,null,null,null,"Y",591,null,591,"Tetryl (2,4,6-Trinitrophenylmethylnitramine; N-Methyl-N-2,4,6-tetranitroaniline)","479-45-8",3,null,1.5,null,null,null,null,null,null,null,"Y",591,null,"","","","","","","","","","","","","","",""]
[null,592,"Thallium, soluble compounds (as Tl)","7440-28-0",3,null,0.1,null,null,null,null,null,null,null,"Y",592,null,592,"Thallium, soluble compounds (as Tl)","7440-28-0",3,null,0.1,null,null,null,null,null,null,null,"Y",592,null,"","","","","","","","","","","","","","",""]
[null,593,"4,4'-Thiobis (6-tert-butyl-m-cresol)","96-69-5","1C",null,10,null,null,null,null,null,null,null,"Y",593,null,593,"4,4'-Thiobis (6-tert-butyl-m-cresol)","96-69-5","1C",null,10,null,null,null,null,null,null,null,"Y",593,null,"","","","","","","","","","","","","","",""]
[null,594,"Thioglycolic acid (Mercaptoacetic acid)","68-11-1","1B",1,3.8,null,null,null,null,null,null,null,"Y",594,null,594,"Thioglycolic acid (Mercaptoacetic acid)","68-11-1","1B",1,3.8,null,null,null,null,null,null,null,"Y",594,null,"","","","","","","","","","","","","","",""]
[null,595,"Thionyl chloride","7719-09-7","1A",null,null,null,null,null,null,1,4.9000000000000004,null,"N",595,null,595,"Thionyl chloride","7719-09-7","1A",null,null,null,null,null,null,1,4.9000000000000004,null,"N",595,null,"","","","","","","","","","","","","","",""]
[null,596,"Thiram (Tetramethyl thiuram disulphide)","137-26-8",3,null,1,null,null,null,null,null,null,null,"Y",596,null,596,"Thiram (Tetramethyl thiuram disulphide)","137-26-8",3,null,1,null,null,null,null,null,null,null,"Y",596,null,"","","","","","","","","","","","","","",""]
[null,597,"Tin, metal","7440-31-5",3,null,2,null,null,null,null,null,null,null,"Y",597,null,597,"Tin, metal","7440-31-5",3,null,2,null,null,null,null,null,null,null,"Y",597,null,"","","","","","","","","","","","","","",""]
[null,598,"Tin, organic compounds (as Sn)","7440-31-5",3,null,0.1,null,null,0.2,null,null,null,null,"Y",598,null,598,"Tin, organic compounds (as Sn)","7440-31-5",3,null,0.1,null,null,0.2,null,null,null,null,"Y",598,null,"","","","","","","","","","","","","","",""]
[null,599,"Tin, oxide & inorganic compounds, except SnH4 (as Sn)","7440-31-5",3,null,2,null,null,null,null,null,null,null,"Y",599,null,599,"Tin, oxide & inorganic compounds, except SnH4 (as Sn)","7440-31-5",3,null,2,null,null,null,null,null,null,null,"Y",599,null,"","","","","","","","","","","","","","",""]
[null,600,"Titanium dioxide ","13463-67-7","1C",null,10,null,null,null,null,null,null,null,"Y",600,null,600,"Titanium dioxide ","13463-67-7","1C",null,10,null,null,null,null,null,null,null,"Y",600,null,"","","","","","","","","","","","","","",""]
[null,601,"Toluene ","108-88-3",4,50,191,null,150,574,null,null,null,null,"Y",601,null,601,"Toluene ","108-88-3",4,50,191,null,150,574,null,null,null,null,"Y",601,null,"","","","","","","","","","","","","","",""]
[null,602,"Toluene-2,4-diisocyanate (TDI)","584-84-9",3,null,0.02,null,null,7.0000000000000007E-2,null,null,null,null,"Y",602,null,602,"Toluene-2,4-diisocyanate (TDI)","584-84-9",3,null,0.02,null,null,7.0000000000000007E-2,null,null,null,null,"Y",602,null,"","","","","","","","","","","","","","",""]
[null,603,"m-Toluidine","108-44-1",2,2,8.8000000000000007,null,null,null,null,null,null,null,"Y",603,null,603,"m-Toluidine","108-44-1",2,2,8.8000000000000007,null,null,null,null,null,null,null,"Y",603,null,"","","","","","","","","","","","","","",""]
[null,604,"o-Toluidine","95-53-4",4,2,8.8000000000000007,null,null,null,null,null,null,null,"Y",604,null,604,"o-Toluidine","95-53-4",4,2,8.8000000000000007,null,null,null,null,null,null,null,"Y",604,null,"","","","","","","","","","","","","","",""]
[null,605,"p-Toluidine","106-49-0",4,2,8.8000000000000007,null,null,null,null,null,null,null,"Y",605,null,605,"p-Toluidine","106-49-0",4,2,8.8000000000000007,null,null,null,null,null,null,null,"Y",605,null,"","","","","","","","","","","","","","",""]
[null,606,"Tributyl phosphate","126-73-8",4,0.2,2.2000000000000002,null,null,null,null,null,null,null,"Y",606,null,606,"Tributyl phosphate","126-73-8",4,0.2,2.2000000000000002,null,null,null,null,null,null,null,"Y",606,null,"","","","","","","","","","","","","","",""]
[null,607,"1,1,2-Trichloro-1,2,2-trifluoroethane (Fluorocarbon 113, Freon 113)","76-13-1",2,1000,7670,null,1250,9590,null,null,null,null,"Y",607,null,607,"1,1,2-Trichloro-1,2,2-trifluoroethane (Fluorocarbon 113, Freon 113)","76-13-1",2,1000,7670,null,1250,9590,null,null,null,null,"Y",607,null,"","","","","","","","","","","","","","",""]
[null,608,"Trichloroacetic acid","76-03-9","1B",1,6.7,null,null,null,null,null,null,null,"Y",608,null,608,"Trichloroacetic acid","76-03-9","1B",1,6.7,null,null,null,null,null,null,null,"Y",608,null,"","","","","","","","","","","","","","",""]
[null,609,"1,2,4-Trichlorobenzene","120-82-1","1A",null,null,null,null,null,null,5,37,null,"N",609,null,609,"1,2,4-Trichlorobenzene","120-82-1","1A",null,null,null,null,null,null,5,37,null,"N",609,null,"","","","","","","","","","","","","","",""]
[null,610,"1,1,1-Trichloroethane (Methyl chloroform)","71-55-6",2,100,555,null,200,1110,null,null,null,null,"Y",610,null,610,"1,1,1-Trichloroethane (Methyl chloroform)","71-55-6",2,100,555,null,200,1110,null,null,null,null,"Y",610,null,"","","","","","","","","","","","","","",""]
[null,611,"1,1,2-Trichloroethane","79-00-5",4,10,55,null,null,null,null,null,null,null,"Y",611,null,611,"1,1,2-Trichloroethane","79-00-5",4,10,55,null,null,null,null,null,null,null,"Y",611,null,"","","","","","","","","","","","","","",""]
[null,612,"Trichloroethylene","79-01-6",4,10,54,null,40,216,null,null,null,null,"Y",612,null,612,"Trichloroethylene","79-01-6",4,10,54,null,40,216,null,null,null,null,"Y",612,null,"","","","","","","","","","","","","","",""]
[null,613,"Trichlorofluoromethane (Fluorocarbon 11, Freon 11, Fluorotrichloromethane)","75-69-4","1A",null,null,null,null,null,null,1000,5620,null,"N",613,null,613,"Trichlorofluoromethane (Fluorocarbon 11, Freon 11, Fluorotrichloromethane)","75-69-4","1A",null,null,null,null,null,null,1000,5620,null,"N",613,null,"","","","","","","","","","","","","","",""]
[null,614,"Trichloronaphthalene","1321-65-9",3,null,5,null,null,null,null,null,null,null,"Y",614,null,614,"Trichloronaphthalene","1321-65-9",3,null,5,null,null,null,null,null,null,null,"Y",614,null,"","","","","","","","","","","","","","",""]
[null,615,"1,2,3-Trichloropropane","96-18-4",4,10,60,null,null,null,null,null,null,null,"Y",615,null,615,"1,2,3-Trichloropropane","96-18-4",4,10,60,null,null,null,null,null,null,null,"Y",615,null,"","","","","","","","","","","","","","",""]
[null,616,"Tridymite (respirable dust)","15468-32-3",3,null,0.1,null,null,null,null,null,null,null,"Y",616,null,616,"Tridymite (respirable dust)","15468-32-3",3,null,0.1,null,null,null,null,null,null,null,"Y",616,null,"","","","","","","","","","","","","","",""]
[null,617,"Triethanolamine","102-71-6",3,null,5,null,null,null,null,null,null,null,"Y",617,null,617,"Triethanolamine","102-71-6",3,null,5,null,null,null,null,null,null,null,"Y",617,null,"","","","","","","","","","","","","","",""]
[null,618,"Triethylamine (N,N-Diethylethanamine)","121-44-8",4,2,8,null,4,17,null,null,null,null,"Y",618,null,618,"Triethylamine (N,N-Diethylethanamine)","121-44-8",4,2,8,null,4,17,null,null,null,null,"Y",618,null,"","","","","","","","","","","","","","",""]
[null,619,"Trifluorobromomethane (Fluorocarbon 13B1, Bromotrifluoromethane)","75-63-8","1C",1000,6090,null,null,null,null,null,null,null,"Y",619,null,619,"Trifluorobromomethane (Fluorocarbon 13B1, Bromotrifluoromethane)","75-63-8","1C",1000,6090,null,null,null,null,null,null,null,"Y",619,null,"","","","","","","","","","","","","","",""]
[null,620,"Triglycidylisocyanurate (TGIC; Araldite PT 810)","2451-62-9",3,null,0.08,null,null,null,null,null,null,null,"Y",620,null,620,"Triglycidylisocyanurate (TGIC; Araldite PT 810)","2451-62-9",3,null,0.08,null,null,null,null,null,null,null,"Y",620,null,"","","","","","","","","","","","","","",""]
[null,621,"Trimellitic anhydride (Benzene-1,2,4-tricarboxylic acid-1,2-anhydride)","552-30-7",3,5.0000000000000001E-3,3.9E-2,null,null,null,null,null,null,null,"Y",621,null,621,"Trimellitic anhydride (Benzene-1,2,4-tricarboxylic acid-1,2-anhydride)","552-30-7",3,5.0000000000000001E-3,3.9E-2,null,null,null,null,null,null,null,"Y",621,null,"","","","","","","","","","","","","","",""]
[null,622,"Trimethyl benzene","25551-13-7",3,25,123,null,null,null,null,null,null,null,"Y",622,null,622,"Trimethyl benzene","25551-13-7",3,25,123,null,null,null,null,null,null,null,"Y",622,null,"","","","","","","","","","","","","","",""]
[null,623,"Trimethyl phosphite","121-45-9","1B",2,10,null,null,null,null,null,null,null,"Y",623,null,623,"Trimethyl phosphite","121-45-9","1B",2,10,null,null,null,null,null,null,null,"Y",623,null,"","","","","","","","","","","","","","",""]
[null,624,"Trimethylamine ","75-50-3","1B",10,24,null,15,36,null,null,null,null,"Y",624,null,624,"Trimethylamine ","75-50-3","1B",10,24,null,15,36,null,null,null,null,"Y",624,null,"","","","","","","","","","","","","","",""]
[null,625,"2,4,6-Trinitrotoluene (TNT)","118-96-7",3,null,0.5,null,null,null,null,null,null,null,"Y",625,null,625,"2,4,6-Trinitrotoluene (TNT)","118-96-7",3,null,0.5,null,null,null,null,null,null,null,"Y",625,null,"","","","","","","","","","","","","","",""]
[null,626,"Triorthocresyl phosphate (Tri o-tolylphosphate)","78-30-8",4,null,0.1,null,null,null,null,null,null,null,"Y",626,null,626,"Triorthocresyl phosphate (Tri o-tolylphosphate)","78-30-8",4,null,0.1,null,null,null,null,null,null,null,"Y",626,null,"","","","","","","","","","","","","","",""]
[null,627,"Triphenyl amine","603-34-9","1C",null,5,null,null,null,null,null,null,null,"Y",627,null,627,"Triphenyl amine","603-34-9","1C",null,5,null,null,null,null,null,null,null,"Y",627,null,"","","","","","","","","","","","","","",""]
[null,628,"Triphenyl phosphate","115-86-6",4,null,3,null,null,null,null,null,null,null,"Y",628,null,628,"Triphenyl phosphate","115-86-6",4,null,3,null,null,null,null,null,null,null,"Y",628,null,"","","","","","","","","","","","","","",""]
[null,629,"Tripoli","1317-95-9",3,null,0.1,null,null,null,null,null,null,null,"Y",629,null,629,"Tripoli","1317-95-9",3,null,0.1,null,null,null,null,null,null,null,"Y",629,null,"","","","","","","","","","","","","","",""]
[null,630,"Tungsten, insoluble compounds (as W)","7440-33-7","1C",null,5,null,null,10,null,null,null,null,"Y",630,null,630,"Tungsten, insoluble compounds (as W)","7440-33-7","1C",null,5,null,null,10,null,null,null,null,"Y",630,null,"","","","","","","","","","","","","","",""]
[null,631,"Tungsten, soluble compounds (as W)","7440-33-7",2,null,1,null,null,3,null,null,null,null,"Y",631,null,631,"Tungsten, soluble compounds (as W)","7440-33-7",2,null,1,null,null,3,null,null,null,null,"Y",631,null,"","","","","","","","","","","","","","",""]
[null,632,"Turpentine (wood)","8006-64-2",4,100,557,null,null,null,null,null,null,null,"Y",632,null,632,"Turpentine (wood)","8006-64-2",4,100,557,null,null,null,null,null,null,null,"Y",632,null,"","","","","","","","","","","","","","",""]
[null,633,"Uranium (natural), soluble & insoluble compounds (as H)","7440-61-1",3,null,0.2,null,null,0.6,null,null,null,null,"Y",633,null,633,"Uranium (natural), soluble & insoluble compounds (as H)","7440-61-1",3,null,0.2,null,null,0.6,null,null,null,null,"Y",633,null,"","","","","","","","","","","","","","",""]
[null,634,"n-Valeraldehyde","110-62-3","1B",50,176,null,null,null,null,null,null,null,"Y",634,null,634,"n-Valeraldehyde","110-62-3","1B",50,176,null,null,null,null,null,null,null,"Y",634,null,"","","","","","","","","","","","","","",""]
[null,635,"Vanadium (as V2O5), (respirable dust & fume)","1314-62-1","1B",null,0.05,null,null,null,null,null,null,null,"Y",635,null,635,"Vanadium (as V2O5), (respirable dust & fume)","1314-62-1","1B",null,0.05,null,null,null,null,null,null,null,"Y",635,null,"","","","","","","","","","","","","","",""]
[null,636,"Vegetable oil mists (except castor oil, cashew nut or similar irritant oils)",null,"1C",null,10,null,null,null,null,null,null,null,"Y",636,null,636,"Vegetable oil mists (except castor oil, cashew nut or similar irritant oils)",null,"1C",null,10,null,null,null,null,null,null,null,"Y",636,null,"","","","","","","","","","","","","","",""]
[null,637,"Vinyl acetate ","108-05-4","1B",10,35,null,20,70,null,null,null,null,"Y",637,null,637,"Vinyl acetate ","108-05-4","1B",10,35,null,20,70,null,null,null,null,"Y",637,null,"","","","","","","","","","","","","","",""]
[null,638,"Vinyl bromide (Bromoethylene)","593-60-2",3,5,22,null,null,null,null,null,null,null,"Y",638,null,638,"Vinyl bromide (Bromoethylene)","593-60-2",3,5,22,null,null,null,null,null,null,null,"Y",638,null,"","","","","","","","","","","","","","",""]
[null,639,"Vinyl chloride, monomer (Chloroethylene)","75-01-4",3,5,13,null,null,null,null,null,null,null,"Y",639,null,639,"Vinyl chloride, monomer (Chloroethylene)","75-01-4",3,5,13,null,null,null,null,null,null,null,"Y",639,null,"","","","","","","","","","","","","","",""]
[null,640,"Vinyl cyclohexene dioxide (1,2-Epoxy-4-(epoxy-ethyl)-cyclohexane)","106-87-6",3,10,57,null,null,null,null,null,null,null,"Y",640,null,640,"Vinyl cyclohexene dioxide (1,2-Epoxy-4-(epoxy-ethyl)-cyclohexane)","106-87-6",3,10,57,null,null,null,null,null,null,null,"Y",640,null,"","","","","","","","","","","","","","",""]
[null,641,"Vinyl toluene (Methyl styrene)","25013-15-4","1B",50,242,null,100,483,null,null,null,null,{"$f":"IF(COUNTA(F646:H646)=0,\"N\",\"Y\")","v":"Y"},{"$f":"B646","v":641},null,641,"Vinyl toluene (Methyl styrene)","25013-15-4","1B",50,242,null,100,483,null,null,null,null,{"$f":"IF(COUNTA(V646:X646)=0,\"N\",\"Y\")","v":"Y"},{"$f":"R646","v":641},null,"","","","","","","","","","","","","","",""]
[null,642,"Vinylidene chloride (1,1-Dichloroethylene)","75-35-4",3,5,20,null,20,79,null,null,null,null,"Y",642,null,642,"Vinylidene chloride (1,1-Dichloroethylene)","75-35-4",3,5,20,null,20,79,null,null,null,null,"Y",642,null,{"$f":"IF(C647=S647,\"\",1)","v":""},{"$f":"IF(D647=T647,\"\",1)","v":""},{"$f":"IF(E647=U647,\"\",1)","v":""},{"$f":"IF(F647=V647,\"\",1)","v":""},{"$f":"IF(G647=W647,\"\",1)","v":""},{"$f":"IF(H647=X647,\"\",1)","v":""},{"$f":"IF(I647=Y647,\"\",1)","v":""},{"$f":"IF(J647=Z647,\"\",1)","v":""},{"$f":"IF(K647=AA647,\"\",1)","v":""},{"$f":"IF(L647=AB647,\"\",1)","v":""},{"$f":"IF(M647=AC647,\"\",1)","v":""},{"$f":"IF(N647=AD647,\"\",1)","v":""},{"$f":"IF(O647=AE647,\"\",1)","v":""},{"$f":"IF(P647=AF647,\"\",1)","v":""},{"$f":"IF(Q647=AG647,\"\",1)","v":""}]
[null,643,"Warfarin","81-81-2",4,null,0.1,null,null,null,null,null,null,null,"Y",643,null,643,"Warfarin","81-81-2",4,null,0.1,null,null,null,null,null,null,null,"Y",643,null,"","","","","","","","","","","","","","",""]
[null,644,"Welding fumes (not otherwise classified)",null,2,null,5,null,null,null,null,null,null,null,"Y",644,null,644,"Welding fumes (not otherwise classified)",null,2,null,5,null,null,null,null,null,null,null,"Y",644,null,"","","","","","","","","","","","","","",""]
[null,645,"White spirits (Stoddard solvent)","8052-41-3",4,null,790,null,null,null,null,null,null,null,"Y",645,null,645,"White spirits (Stoddard solvent)","8052-41-3",4,null,790,null,null,null,null,null,null,null,"Y",645,null,"","","","","","","","","","","","","","",""]
[null,646,"Wood dust (certain hardwoods such as beech & oak)",null,3,null,1,null,null,null,null,null,null,null,"Y",646,null,646,"Wood dust (certain hardwoods such as beech & oak)",null,3,null,1,null,null,null,null,null,null,null,"Y",646,null,"","","","","","","","","","","","","","",""]
[null,647,"Wood dust (soft wood)",null,3,null,5,null,null,10,null,null,null,null,"Y",647,null,647,"Wood dust (soft wood)",null,3,null,5,null,null,10,null,null,null,null,"Y",647,null,"","","","","","","","","","","","","","",""]
[null,648,"Xylene (o-, m-, p- isomers)",null,2,80,350,null,150,655,null,null,null,null,"Y",648,null,648,"Xylene (o-, m-, p- isomers)",null,2,80,350,null,150,655,null,null,null,null,"Y",648,null,"","","","","","","","","","","","","","",""]
[null,649,"m-Xylene-alpha,alpha'-diamine (m-Xylylendiamine; 1,3-Benzenedimethanamine)","1477-55-0","1A",null,null,null,null,null,null,null,0.1,null,"N",649,null,649,"m-Xylene-alpha,alpha'-diamine (m-Xylylendiamine; 1,3-Benzenedimethanamine)","1477-55-0","1A",null,null,null,null,null,null,null,0.1,null,"N",649,null,"","","","","","","","","","","","","","",""]
[null,650,"Xylidine (Dimethylaminobenzene, Aminodimethyl benzene)","1300-73-8",3,0.5,2.5,null,null,null,null,null,null,null,"Y",650,null,650,"Xylidine (Dimethylaminobenzene, Aminodimethyl benzene)","1300-73-8",3,0.5,2.5,null,null,null,null,null,null,null,"Y",650,null,"","","","","","","","","","","","","","",""]
[null,651,"Yttrium, metal & compounds (as Y)","7440-65-5",3,null,1,null,null,null,null,null,null,null,"Y",651,null,651,"Yttrium, metal & compounds (as Y)","7440-65-5",3,null,1,null,null,null,null,null,null,null,"Y",651,null,"","","","","","","","","","","","","","",""]
[null,652,"Zinc chloride (fume)","7646-85-7",2,null,1,null,null,2,null,null,null,null,"Y",652,null,652,"Zinc chloride (fume)","7646-85-7",2,null,1,null,null,2,null,null,null,null,"Y",652,null,"","","","","","","","","","","","","","",""]
[null,653,"Zinc chromates (as Cr) [11103-86-9, 13530-65-9, 37300-23-5]","13530-65-9",3,null,0.01,null,null,null,null,null,null,null,"Y",653,null,653,"Zinc chromates (as Cr) [11103-86-9, 13530-65-9, 37300-23-5]","13530-65-9",3,null,0.01,null,null,null,null,null,null,null,"Y",653,null,"","","","","","","","","","","","","","",""]
[null,654,"Zinc oxide (dust) ","1314-13-2","1C",null,10,null,null,null,null,null,null,null,"Y",654,null,654,"Zinc oxide (dust) ","1314-13-2","1C",null,10,null,null,null,null,null,null,null,"Y",654,null,"","","","","","","","","","","","","","",""]
[null,655,"Zinc oxide (fume)","1314-13-2",2,null,5,null,null,10,null,null,null,null,"Y",655,null,655,"Zinc oxide (fume)","1314-13-2",2,null,5,null,null,10,null,null,null,null,"Y",655,null,"","","","","","","","","","","","","","",""]
[null,656,"Zirconium compounds (as Zr)","7440-67-7","1C",null,5,null,null,10,null,null,null,null,"Y",656,null,656,"Zirconium compounds (as Zr)","7440-67-7","1C",null,5,null,null,10,null,null,null,null,"Y",656,null,"","","","","","","","","","","","","","",""]